Difference between revisions of "14.12/TestReports/20141218"

From Apertis
Jump to: navigation, search
Line 9: Line 9:
  
 
----
 
----
 
The platform image used for these tests are :
 
 
* [https://images.ecore.collabora.co.uk/release/14.12/collabora-14.12-i386-target_141219-001801-sac_9.00.00.btrfs.img.gz Target x86 (2014-12-18)]
 
* [https://images.ecore.collabora.co.uk/release/14.12/collabora-14.12-i386-development_141219-001801-sac_9.00.00.btrfs.img.gz Development x86 (2014-12-18)]
 
* [https://images.ecore.collabora.co.uk/release/14.12/collabora-14.12-i386-sdk_141219-001801-sac_9.00.00.ext4.vdi.gz SDK x86 (2014-12-18)]
 
 
  
  

Revision as of 15:11, 18 November 2015

Testing results considerations:

  1. All manual test cases were executed on both, Target x86 and SDK x86 image, and were executed as needed by the development team on the Target ARM image.
  2. All automated test cases already integrated into LAVA system were executed on three images: Target x86, Development x86 and SDK x86.
  3. Test cases marked as 'under development' were skipped during this testing round.
  4. Failures and partial failures were noted in the Release notes document for further analyse.




ID Description Type Target ARM Devel ARM Target x86 Devel x86 SDK x86 Tested By Notes
Booting
image-bootable Test whether the image is bootable. Not Integrated NOT TESTED NOT TESTED PASSED PASSED PASSED Piyush Vijeth
image-x-start Test whether the image starts a graphical environment. Not Integrated NOT TESTED NOT TESTED PASSED PASSED PASSED Piyush Vijeth
HW Acceleration
x-hw-accelerated Test whether the correct GLES2 render is used. Not Integrated NOT TESTED N/A PASSED N/A PASSED Piyush Vijeth
GStreamer
clutter-playback-gstreamer1.0 Test video and audio playback using clutter-gst and GStreamer1.0. Not Integrated NOT TESTED N/A PASSED N/A FAILED Piyush Vijeth Not audible due to bug 3231 and bug 3226
gstreamer1.0-decode Test video and audio decoders and demuxers on a list of media. Integrated NOT TESTED N/A NOT TESTED NOT TESTED NOT TESTED
Multitouch
clutter-actors-bigger-reactive-area Test that Clutter allows an actor's pick area to be larger than its paint area. Not Integrated NOT TESTED N/A PASSED N/A PASSED Piyush Vijeth
clutter-mt-rotate Test that clutter properly performs rotation gestures. Not Integrated NOT TESTED N/A PASSED N/A N/A Piyush
clutter-mt-touch-events Test multi-touch support in Clutter. Not Integrated NOT TESTED N/A PASSED N/A N/A Piyush
clutter-mt-zoom Test that clutter properly performs zoom gestures. Not Integrated NOT TESTED N/A PASSED N/A N/A Piyush
clutter-transparent-stage Test that clutter transparent stages are correctly handled by the graphics stack. Not Integrated NOT TESTED N/A PASSED N/A N/A Piyush
mutter-mt-touch-events Allow Mutter plugins to recognize multi-touch gestures.

This test is used for both touchscreen *and* the Magic Trackpad. So please, do test for both cases below:

Not Integrated NOT TESTED N/A PASSED N/A N/A Piyush
webkit-mt-touch-events Test implementation of W3C touch events API in webkit-clutters. Not Integrated NOT TESTED N/A PASSED N/A N/A Piyush
xephyr-mt-touch-events Test that X clients within Xephyr receive touch events forwarded from the host X display.

This test is used for both touchscreen *and* support for the Magic Trackpad. So please, do test for both cases below:

Not Integrated N/A N/A N/A N/A FAILED Vijeth Not able to pair with trackpad,bluetoothd not running
WebKit
webkit-actor-tiles Test implementation of actor-based tiled backing store in webkit-clutter. Not Integrated NOT TESTED N/A PASSED N/A PASSED Piyush Vijeth
webkit-event-handling-redesign Test WebKit-Clutter ability to scroll by touch with inertial behaviour after the touch ended. Not Integrated NOT TESTED N/A PASSED N/A PASSED Piyush Vijeth
webkit-layout-tests Layout tests are used to check the correctness of the renderer. It involves loading pages in a test renderer (DumpRenderTree) and comparing the rendered output tree against an expected output file. Integrated N/A N/A NOT TESTED NOT TESTED NOT TESTED
Webkit-AC
webkit-ac-3d-rendering Test that 3D transforms are applied correctly. Not Integrated NOT TESTED N/A PASSED N/A PASSED Piyush Vijeth
webkit-ac-animations Test that Clutter actors created for representing layers animate properly. Not Integrated NOT TESTED N/A PASSED N/A PASSED Piyush Vijeth
webkit-ac-scrolling Test that actors created for representing layers scroll properly. Not Integrated NOT TESTED N/A PASSED N/A PASSED Piyush Vijeth
Gettext
clutter-i18n-gettext Check that internationalization (translation) of Clutter applications using gettext works. Not Integrated NOT TESTED N/A PASSED N/A PASSED Piyush Vijeth
gettext-i18n Check that gettext internationalization works. Integrated NOT TESTED N/A NOT TESTED NOT TESTED NOT TESTED
'
gupnp-services Run a few tests related to service browsing, introspection, etc. Integrated NOT TESTED N/A NOT TESTED NOT TESTED NOT TESTED
librest-unit Run the unit tests that ship with the library against the running system. Integrated NOT TESTED N/A NOT TESTED NOT TESTED NOT TESTED
libsoup-unit Run the unit tests that ship with the library against the running system. Integrated NOT TESTED N/A NOT TESTED NOT TESTED NOT TESTED
tracker-configuration Check if tracker indexing is configured properly. Integrated NOT TESTED N/A NOT TESTED NOT TESTED NOT TESTED
tracker-indexing-local-storage Check tracker indexing of local storage and journal behaviour. Integrated NOT TESTED N/A NOT TESTED NOT TESTED NOT TESTED
tracker-indexing-mass-storage Check tracker indexes mass storage devices on insertion. Not Integrated NOT TESTED N/A FAILED N/A FAILED Piyush Vijeth bug 3232 bug 3028
tumbler-thumbnailing Check that all thumbnailing features of tumbler are working properly (large, small, videos, documents, images). Integrated NOT TESTED N/A NOT TESTED NOT TESTED NOT TESTED
Grilo
grilo Check grilo metadata notifications, and filesystem browsing. Integrated NOT TESTED N/A NOT TESTED NOT TESTED NOT TESTED
Networking
bluez-avrcp-volume Test the AVRCP volume up and down commands. Not Integrated NOT TESTED N/A FAILED N/A N/A Piyush bug 3026
bluez-phone Test all BlueZ features needing interaction with a phone (Pairing, OBEX, PBAP, AVRCP, A2DP, HSP, HFP, PAN). Not Integrated NOT TESTED N/A FAILED N/A FAILED Piyush Vijeth bug 3227
bluez-setup Test setup of Bluetooth stack by running basic tests using hciconfig. Check if the interface can be brought up/down, can be changed of mode and can discover devices. Not Integrated NOT TESTED N/A FAILED N/A FAILED Piyush Vijeth bluetoothd is not running
connman Runs some automated tests using the ConnMan D-Bus API. It guarantees most of the basic features are working. Integrated NOT TESTED N/A NOT TESTED NOT TESTED NOT TESTED
connman-new-supplicant Test the wpa_supplicant interface. Integrated NOT TESTED N/A NOT TESTED NOT TESTED NOT TESTED
connman-pan-tethering Test ConnMan support for PAN connectivity. Not Integrated NOT TESTED N/A NOT TESTED N/A NOT TESTED Blocked because of bug 3026
connman-services Tests ConnMan services. Not Integrated NOT TESTED N/A PASSED N/A PASSED Piyush Vijeth
connman-usb-tethering Test ConnMan support for USB tethering (connection side). Not Integrated NOT TESTED N/A PASSED N/A N/A Piyush
ofono-sms-receive Test receiving SMS messages with oFono. Not Integrated N/A N/A FAILED N/A FAILED Piyush Vijeth bug 3230
ofono-sms-send Test sending of SMS with oFono. Not Integrated N/A N/A FAILED N/A FAILED Piyush Vijeth bug 3230
Folks
folks-alias-persistence Ensures user-set contact aliases persist. Integrated NOT TESTED N/A NOT TESTED NOT TESTED NOT TESTED
folks-eds-compatibility Checks that contacts created within Evolution Data Server (as will happen when phone contacts get synchronized to an Apertis machine) show up in other contact-based programs. Integrated NOT TESTED N/A NOT TESTED NOT TESTED NOT TESTED
folks-metacontacts-linking Ensures linking meta-contacts works properly. Integrated NOT TESTED N/A NOT TESTED NOT TESTED NOT TESTED
folks-metacontacts-unlinking Ensures unlinking meta-contacts works properly. Integrated NOT TESTED N/A NOT TESTED NOT TESTED NOT TESTED
folks-telepathy-retrieve-contacts Ensures that Folks can correctly retrieve Telepathy contacts. Integrated NOT TESTED N/A NOT TESTED NOT TESTED NOT TESTED
LibsocialWeb
libsocialweb-available Ensures libsocialweb client is available. Integrated NOT TESTED N/A NOT TESTED NOT TESTED NOT TESTED
folks-libsocialweb-available Ensures folks libsocialweb backend is available. Integrated NOT TESTED N/A NOT TESTED NOT TESTED NOT TESTED
Telepathy
telepathy-gabble-unit Run telepathy-gabble test suite. Integrated NOT TESTED N/A NOT TESTED NOT TESTED NOT TESTED
telepathy-rakia Test Telepathy rakia integration Not Integrated NOT TESTED N/A PASSED N/A PASSED Piyush Vijeth
SDK Development
sdk-ide-build-run-program Creates a simple test project and confirms that compiling and executing work. Not Integrated N/A N/A N/A N/A PASSED Vijeth
sdk-nested-wm Tests that Devilspie scripts can be applied to windows running within Mutter. Not Integrated N/A N/A N/A N/A PASSED Vijeth
Apparmor Basic
apparmor-basic-profiles Test basic apparmor profiles. Only parsing and syntax of profiles are tested for now. Integrated NOT TESTED N/A NOT TESTED NOT TESTED NOT TESTED
CGroups
cgroups-resource-control Run cgroup resource control tests Integrated NOT TESTED N/A NOT TESTED NOT TESTED NOT TESTED
SDK
sdk-performance-tools-gprof-smoke-test Checks basic gprof functionality by ensuring a CPU-intensive program shows up in its log as consuming the vast majority of the CPU cycles. Integrated N/A N/A N/A N/A NOT TESTED
sdk-performance-tools-sysprof-smoke-test Checks basic sysprof functionality by ensuring a CPU-intensive program shows up in its log as consuming the vast majority of the CPU cycles. Integrated N/A N/A N/A N/A NOT TESTED
sdk-debug-tools-gdb-smoke-test Checks basic gdb functionality by stopping a program at a set point and checking its backtrace matches expectations. Integrated N/A N/A N/A N/A NOT TESTED
sdk-debug-tools-strace-smoke-test Checks basic strace functionality by checking its output when run on a simple command line program. Integrated N/A N/A N/A N/A NOT TESTED
sdk-debug-tools-valgrind-smoke-test Checks basic valgrind functionality by running a program with and without memory leaks, ensuring expected results from valgrind. Integrated N/A N/A N/A N/A NOT TESTED
sdk-dbus-tools-bustle-smoke-test Test that bustle-dbus-monitor shows services on the session bus. Not Integrated N/A N/A N/A N/A FAILED Vijeth bug 3235
sdk-dbus-tools-d-feet-smoke-test Test that D-Feet both shows services on the session bus and that new services appear automatically. Not Integrated N/A N/A N/A N/A FAILED Vijeth bug 3235
sdk-code-analysis-tools-gcov-smoke-test Checks basic gcov functionality by running a sample program a few different ways and ensuring that a sufficient portion of its code paths are executed Integrated N/A N/A N/A N/A NOT TESTED
sdk-code-analysis-tools-splint-smoke-test Checks basic splint functionality by checking its output when run on a simple source file. Integrated N/A N/A N/A N/A NOT TESTED
sdk-vb-fullscreen Tests that the SDK VM can be fullscreened in VirtualBox Not Integrated N/A N/A N/A N/A PASSED Vijeth
Eclipse
eclipse-sysroot-management Test sysroot management and update within Eclipse. It will go through configuring an existing sysroot in Eclipse, and then updating it from the web with the latest version. Not Integrated N/A N/A N/A N/A PASSED Vijeth
eclipse-install-to-target Test copying files to the remote device from within Eclipse. It will create a dummy project and then create a configuration to copy the binary file to a remote device and debug it remotely using Eclipse. Not Integrated N/A N/A N/A N/A PASSED Vijeth
eclipse-remote-debugging Test remote debugging within Eclipse. It will create a dummy project and then create a configuration to copy the binary file to a remote device and debug it remotely using Eclipse. Not Integrated N/A N/A N/A N/A NOT TESTED Vijeth No new connection under C/C++ Remote Application.
Contacts
evolution-sync-bluetooth Synchronizing Bluetooth-paired phone contacts to Evolution. Not Integrated NOT TESTED N/A NOT TESTED N/A NOT TESTED Blocked because of bug 3026
folks-metacontacts-antilinking Ensures anti-linking meta-contacts works properly. Integrated NOT TESTED N/A NOT TESTED NOT TESTED NOT TESTED
Clutter Multitouch
xoo-soft-keys-emulation Test that 'xoo' allows one to pass-in Xephyr-nested key events from clicking UI buttons Integrated N/A N/A N/A N/A NOT TESTED
clutter-performance Test performance of Clutter Integrated NOT TESTED N/A NOT TESTED NOT TESTED NOT TESTED
x-out-of-screen-events-buttond Test that buttond generates correct keystrokes in response to simulated touch screen input Integrated NOT TESTED N/A NOT TESTED NOT TESTED NOT TESTED
mxkineticscrollview-smooth-pan Some low-resolution touch screens send touch events in widely separate time intervals, which causes MxKineticScrollView widget to jump from one position to the next one without any visible transition. This test case implements a long list to scroll through to make sure there are no visible "jumps" when scrolling. Not Integrated NOT TESTED N/A PASSED N/A PASSED Piyush Vijeth
Connectivity
bluez-hfp Test Hands Free Profile (HFP) BlueZ feature. Not Integrated N/A N/A FAILED N/A N/A Piyush bug 3228
rfkill-toggle Test that rfkill is functional. Not Integrated NOT TESTED N/A PASSED N/A N/A Piyush
telepathy-ring Support making and receiving phone calls in Telepathy manually, with a bluetooth-paired phone. Not Integrated NOT TESTED N/A NOT TESTED N/A NOT TESTED Blocked because of bug 3026
telepathy-ring-automated Support making and receiving phone calls in Telepathy. Integrated N/A N/A N/A N/A NOT TESTED
Contacts
folks-ofono-backend Reading contacts from 3G modem SIM card. Not Integrated N/A N/A FAILED N/A FAILED Piyush Vijeth bug 3233
folks-search-contacts Ensures that Folks can correctly search contacts. Integrated NOT TESTED N/A NOT TESTED NOT TESTED NOT TESTED
abstract-contact-addressbook-creation A way to be able to create abstract addressbook is needed in SyncEvolution, so that separate addressbooks can be created for each paired device. Integrated NOT TESTED N/A NOT TESTED NOT TESTED NOT TESTED
folks-sync-only Test SYNCHRONIZE_ONLY flag for persona stores in Folks. Integrated N/A N/A N/A N/A NOT TESTED
storage-arbitrary-data-contacts Support for storing arbitrary data in contacts in Folks. Integrated NOT TESTED N/A NOT TESTED NOT TESTED NOT TESTED
Meta Data Management
grilo-playlist-browsing Test playlist browsing from grilo, that is basically Grilo can inspect playlist contents and show its entries as if they were Grilo Media objects. Integrated NOT TESTED N/A NOT TESTED NOT TESTED NOT TESTED
Multimedia
webkit-gstreamer1.0 Tests html5 video playback with GStreamer 1.0 in WebKit-Clutter Not Integrated NOT TESTED N/A PARTIAL N/A PARTIAL Piyush Vijeth Pulseaudio not running hence no audio
clutter-buffering-2.0 Test clutter-gst stream buffering support against gstreamer 1.0. Not Integrated NOT TESTED N/A PASSED N/A PASSED Piyush Vijeth
clutter-live-media-2.0 Test clutter-gst live media improvements support against gstreamer 1.0. Not Integrated NOT TESTED N/A PASSED N/A PASSED Piyush Vijeth
traffic-control-basic Test basic traffic control support. This test does not use tcmmd but it could catch missing support in the kernel or misbehaving traffic control. Not Integrated NOT TESTED N/A PASSED N/A PASSED Piyush Vijeth
traffic-control-tcmmd Test traffic control support with tcmmd and wget. Not Integrated NOT TESTED N/A PASSED N/A PASSED Piyush Vijeth
traffic-control-tcdemo Test traffic control demo with tcmmd and tcdemo. Not Integrated NOT TESTED N/A PASSED N/A N/A Piyush
gstreamer-buffering Test the download-buffering playback mode of clutter-gst-3.0. Not Integrated NOT TESTED N/A FAILED N/A FAILED Piyush Vijeth bug 3226
gstreamer-splash Test whether the gstreamer splash plugin is working. Not Integrated NOT TESTED N/A N/A N/A N/A
video-animation-on-boot Test whether Plymouth is able to display a graphical theme. Not Integrated NOT TESTED N/A PASSED N/A N/A Piyush
gstreamer-viv-direct-texture Test the GStreamer integration of the Vivante direct texture extension, which enables fast video playback on i.MX6. Not Integrated NOT TESTED N/A N/A N/A N/A
Robustness
glib-gio-fs Run the GLib gio tests that do I/O on the local filesystem. Integrated NOT TESTED N/A NOT TESTED NOT TESTED NOT TESTED
sqlite-veryquick Run the "veryquick" tests shipped with SQLite. Integrated NOT TESTED N/A NOT TESTED NOT TESTED NOT TESTED
Security
apparmor Functional testing for AppArmor functionalities. Integrated NOT TESTED N/A NOT TESTED NOT TESTED NOT TESTED
apparmor-chaiwala-system Test that AppArmor's system wide rules works according to Chaiwala (Ceylon) security goals. Integrated NOT TESTED N/A NOT TESTED NOT TESTED NOT TESTED
apparmor-functional-demo Show some main AppArmor functionalities, like transitions, net access or resource permissions, under the form of tests. Integrated NOT TESTED N/A NOT TESTED NOT TESTED NOT TESTED
apparmor-utils Test apparmor_parser and other tools in apparmor package can be executed. Integrated NOT TESTED N/A NOT TESTED NOT TESTED NOT TESTED
apparmor-session-lockdown-denies Test that the MxLauncher profile is indeed limited to what is allows. Not Integrated NOT TESTED N/A FAILED N/A N/A Piyush The test launcher window is not coming up
apparmor-session-lockdown-launcher-whitelist Make sure our demo/test launcher is applying the white-list approach properly. Not Integrated NOT TESTED N/A FAILED N/A N/A Piyush The test launcher window is not coming up
apparmor-session-lockdown-no-deny Test that the session lockdown profile is not blocking more than it should Not Integrated NOT TESTED N/A FAILED N/A N/A Piyush bug 3234
apparmor-gstreamer1.0 Test that AppArmor profiles provided in GStreamer 1.0 works without Auditd complaining Integrated NOT TESTED N/A NOT TESTED NOT TESTED NOT TESTED
apparmor-pulseaudio Test that AppArmor profiles provided in PulseAudio 2.1 work without Auditd complaining. Integrated NOT TESTED N/A NOT TESTED N/A N/A
apparmor-webkit-clutter Tests that the webkit-clutter abstraction doesn't cause false negatives and that it does not allow arbitrary reading of files in the home directory. Integrated NOT TESTED N/A NOT TESTED NOT TESTED NOT TESTED
apparmor-bluez-automated Test AppArmor profile for support for SPP profile (bluez-spp) and core functionalities (bluez-core). Not Integrated N/A N/A FAILED N/A N/A Piyush bug 3225
apparmor-bluez-avrcp-volume Test AppArmor profile for Bluez AVRCP volume up and down commands. Not Integrated NOT TESTED N/A NOT TESTED N/A N/A Blocked because of bug 3026
apparmor-bluez-setup Test AppArmor profiles for setting up of Bluetooth stack by running basic tests using hciconfig. Check if the interface can be brought up/down, can be changed of mode and can discover devices. Not Integrated N/A N/A FAILED N/A N/A Piyush bluetoothd is not running
apparmor-folks Test that AppArmor profiles provided in Folks package work without unexpected auditd log entries. Integrated NOT TESTED N/A NOT TESTED NOT TESTED NOT TESTED
apparmor-geoclue Test that geoclue apparmor profiles are working properly Integrated NOT TESTED N/A NOT TESTED NOT TESTED NOT TESTED
apparmor-libreoffice Tests that the libreoffice profile doesn't cause false negatives and that it does not allow arbitrary reading of files in the home directory. Integrated NOT TESTED N/A NOT TESTED NOT TESTED NOT TESTED
apparmor-ofono Test that AppArmor profiles provided in ofono package work without unexpected auditd log entries. Not Integrated N/A N/A FAILED N/A N/A Piyush bug 3229
apparmor-tracker Tests that the tracker abstraction and tracker profiles don't cause false negatives and that it does not allow arbitrary reading of files in the home directory. Integrated NOT TESTED N/A NOT TESTED NOT TESTED NOT TESTED
apparmor-tumbler Tests that the tumbler profile doesn't cause false negatives and that it does not allow arbitrary reading of files in the home directory. Integrated NOT TESTED N/A NOT TESTED NOT TESTED NOT TESTED
iptables-basic Test the firewall automatically. Integrated NOT TESTED N/A NOT TESTED NOT TESTED NOT TESTED
iptables-nmap Test the firewall using nmap from another computer. Not Integrated NOT TESTED N/A PASSED N/A PASSED Piyush Vijeth
apparmor-dbus Functional testing for AppArmor D-Bus mediation. Integrated NOT TESTED N/A NOT TESTED NOT TESTED NOT TESTED
System Update
updater-update-platform Test that chaiwala-updater is capable of performing a full platform update. Not Integrated NOT TESTED N/A N/A N/A N/A
btrfs-snapshot-management Test subvolume management using Btrfs for system upgrades. Integrated NOT TESTED N/A NOT TESTED NOT TESTED NOT TESTED
factory-reset-tool Check if the system can be restored to a factory reset state. Not Integrated NOT TESTED N/A N/A N/A N/A
last-resort-message Test whether U-Boot last resort image is displayed on boot failure Not Integrated NOT TESTED N/A N/A N/A N/A
limited-functionality-manual Test whether the limited functionality mode can be triggered. Not Integrated NOT TESTED N/A N/A N/A N/A
v4l-automated Test the v4l codepaths of chaiwala-v4l2fb. Integrated N/A N/A NOT TESTED NOT TESTED N/A
boot-performance Test boot performance. Not Integrated NOT TESTED N/A N/A N/A N/A
boot-performance-automated Test boot performance. Integrated NOT TESTED N/A NOT TESTED NOT TESTED NOT TESTED
Webkit
webkit-aligned-scroll Test that scrolling is pinned in a given direction when started mostly towards it. Not Integrated NOT TESTED N/A PASSED N/A N/A Piyush
webkit-lazy-click Test touch adjustment (lazy click) support in WebKit-Clutter Not Integrated NOT TESTED N/A PASSED N/A PASSED Piyush Vijeth
webkit-drag-and-drop Test HTML5 drag-and-drop support in WebKit-Clutter Not Integrated NOT TESTED N/A PASSED N/A PASSED Piyush Vijeth
webkit-contextual-zoom This test case is about zooming parts of a web page to make it easier to read on devices with limited screen area. The scope of the test is the zooming functionality that takes into account the content in the clicked area, other functionality that belongs to a real browser isn't to be tested here. Not Integrated NOT TESTED N/A PASSED N/A PASSED Piyush Vijeth
webkit-clutter-javascriptcore JavaScriptCore tests are implementation of the Mozilla JavaScript Test Suite. This test suite covers the functionality of the core JavaScript engine. This includes several JavaScript objects such as Arrays, Booleans, Dates, Functions, Global Object, Math, Numbers, Objects, Regular Expressions and Strings. In addition the JavaScript tests cover parsing, lexical conventions, expressions, statements, type conversion, and exception handling. Integrated NOT TESTED N/A NOT TESTED NOT TESTED NOT TESTED
PASSED - All tests passed.
PARTIAL - Tests mostly passed, with some minor problems.
FAILED - One or more tests failed.
NOT TESTED - Test not run due to some issue, like WIP, Disabled, lacking proper hardware.