18.12/TestReports/20190315/tiny-containers

From Apertis
Jump to: navigation, search


Testing results considerations:

  1. These tests use tiny container images.
  2. All automated test cases already integrated into LAVA system were executed on the following images: Arm, Arm64, AMD64.
  3. Failures and partial failures were filed as bugs in Phabricator for further investigation and analysis.

The platform image used for these tests are:

ID Description Type Arm Arm64 AMD64 Tested By Notes
Privileged system containers
tiny-container-system-basic Basic functionality of Tiny system-wide privileged container Integrated FAILED PASSED PASSED d4s [1] [2] [3] armhf:T4693
tiny-container-system-connectivity-profile Test of AppArmor profile for Tiny system-wide privileged container Integrated FAILED PARTIAL PARTIAL d4s [4] [5] [6] T5763 armhf:T4693
tiny-container-system-aa-enforcement Test that the AppArmor profile for dbus-daemon is loaded in system-wide privileged container Integrated FAILED PASSED PASSED d4s [7] [8] [9] armhf:T4693
tiny-container-system-device-sharing Test of device sharing between host and Tiny system-wide privileged container Integrated FAILED PASSED PASSED d4s [10] [11] [12] armhf:T4693
tiny-container-system-folder-sharing Test of folder sharing between host and Tiny system-wide privileged container started as user Integrated FAILED PASSED PASSED d4s [13] [14] [15] armhf:T4693
tiny-container-system-seccomp Test that the custom seccomp profile could be applied for system-wide privileged container Integrated FAILED PASSED PASSED d4s [16] [17] [18] armhf:T4693


Non-privileged userspace containers
tiny-container-user-basic Basic functionality of unprivileged tiny container started as user Integrated FAILED PASSED PASSED d4s [19] [20] [21] armhf:T4693
tiny-container-user-connectivity-profile Test of AppArmor profile for Tiny unprivileged container started as user Integrated FAILED PARTIAL PARTIAL d4s [22] [23] [24] T5763 armhf:T4693
tiny-container-user-aa-enforcement Test that the AppArmor profile for dbus-daemon is loaded in unprivileged container started as user Integrated FAILED PASSED PASSED d4s [25] [26] [27] armhf:T4693
tiny-container-user-device-sharing Test of device sharing between host and Tiny unprivileged container started as user Integrated FAILED PASSED PASSED d4s [28] [29] [30] armhf:T4693
tiny-container-user-folder-sharing Test of folder sharing between host and Tiny unprivileged container started as user Integrated FAILED PASSED PASSED d4s [31] [32] [33] armhf:T4693
tiny-container-user-seccomp Test that the custom seccomp profile could be applied for unprivileged container started as user Integrated FAILED PASSED PASSED d4s [34] [35] [36] armhf:T4693
PASSED - All tests passed.
PARTIAL - Tests mostly passed, with some minor problems.
FAILED - One or more tests failed.
NOT TESTED - Test not run due to some issue, like WIP, Disabled, lacking proper hardware.
CRITICAL test case - release blocker
HIGH priority test case - must be tested every week
MEDIUM priority test case - must be tested at least every other week
LOW priority test case - test when possible
Personal tools
Namespaces

Variants
Actions
Navigation
Tools