17.12/TestReports/20171213

From Apertis
Jump to: navigation, search

Testing results considerations:

  1. Manual test cases were executed on target ARM, target AMD64 and SDK AMD64 images when applicable.
  2. All automated test cases already integrated into LAVA system were executed on the following images: target ARM, target AMD64, development AMD64, and SDK AMD64.
  3. Failures and partial failures were filed as bugs in Phabricator for further investigation and analysis.



The platform image used for these tests are:

ID Description Type Minimal ARM Minimal ARM64 Minimal AMD64 Target ARM Target AMD64 Development ARM Development AMD64 SDK AMD64 Tested By Notes
Sanity
sanity-check Check that the Apertis system basically works. (manual) Not Integrated PASSED NOT TESTED NOT TESTED PASSED PASSED PASSED PASSED PASSED Sagar
sanity-check Check that the Apertis system basically works. (automated) Integrated PASSED PASSED PASSED PASSED PASSED PASSED PASSED PASSED andrewsh [1] [2] [3] [4] [5] [6] [7] [8] [9]
Booting
image-bootable Test whether the image is bootable. Not Integrated PASSED NOT TESTED PASSED PASSED PASSED PASSED PASSED PASSED Sagar
image-gui-start Test whether the image starts a graphical environment. Not Integrated N/A N/A N/A PASSED PASSED PASSED PASSED PASSED Sagar
HW Acceleration
x-hw-accelerated Test whether the correct GLES2 render is used. Not Integrated N/A N/A N/A N/A N/A N/A N/A PASSED Sagar
GStreamer
gstreamer1.0-decode Test video and audio decoders and demuxers on a list of media. Integrated NOT TESTED NOT TESTED NOT TESTED PASSED NOT TESTED PASSED PASSED PASSED andrewsh [10] [11] [12] [13]
Multitouch
webkit2gtk-mt-touch-events Test implementation of W3C touch events API in WebKit2GTK. Not Integrated N/A N/A N/A PASSED PASSED N/A PASSED PASSED Sagar
WebKit
webkit2gtk-actor-tiles Test implementation of actor-based tiled backing store in webkit2GTK. Not Integrated N/A N/A N/A PASSED PASSED N/A PASSED PASSED Sagar T1964
webkit2gtk-event-handling-redesign Test WebKit2Gtk ability to scroll by touch with inertial behaviour after the touch ended. Not Integrated N/A N/A N/A PASSED PASSED N/A PASSED PASSED Sagar
Webkit2GTK-AC
webkit2gtk-ac-3d-rendering Test that 3D transforms are applied correctly. Not Integrated N/A N/A N/A PASSED PASSED N/A PASSED PASSED Sagar
webkit2gtk-ac-animations Test that Webkit2GTK actors created for representing layers animate properly. Not Integrated N/A N/A N/A PASSED PASSED N/A PASSED PASSED Sagar
webkit2gtk-ac-scrolling Test that actors created for representing layers scroll properly. Not Integrated N/A N/A N/A PASSED PASSED N/A PASSED PASSED Sagar T1964
Gettext
gettext-i18n Check that gettext internationalization works. Integrated FAILED FAILED FAILED FAILED NOT TESTED FAILED FAILED FAILED andrewsh [14] [15] [16] [17] [18] [19] [20]
Meta Data Management
gupnp-services Run a few tests related to service browsing, introspection, etc. Integrated PASSED PASSED PASSED FAILED NOT TESTED FAILED PASSED PASSED andrewsh [21] [22] [23] [24] [25] [26] [27]
librest-unit Run the unit tests that ship with the library against the running system. Integrated NOT TESTED NOT TESTED NOT TESTED PASSED NOT TESTED PASSED PASSED PASSED andrewsh [28] [29] [30] [31]
libsoup-unit Run the unit tests that ship with the library against the running system. Integrated NOT TESTED NOT TESTED NOT TESTED PASSED NOT TESTED PASSED PASSED PASSED andrewsh [32] [33] [34] [35]
tracker-indexing-local-storage Check tracker indexing of local storage and journal behaviour. Integrated NOT TESTED NOT TESTED NOT TESTED FAILED NOT TESTED FAILED FAILED FAILED andrewsh [36] [37] [38] [39]
tracker-indexing-mass-storage Check tracker indexes mass storage devices on insertion. Not Integrated N/A N/A N/A FAILED FAILED N/A FAILED FAILED Sagar T4409
tumbler-thumbnailing Check that all thumbnailing features of tumbler are working properly (large, small, videos, documents, images). Integrated NOT TESTED NOT TESTED NOT TESTED PASSED NOT TESTED PASSED PASSED PASSED andrewsh [40] [41] [42] [43]
Grilo
grilo Check grilo metadata notifications, and filesystem browsing. Integrated FAILED FAILED FAILED PASSED NOT TESTED PASSED PASSED PASSED andrewsh [44] [45] [46] [47] [48] [49] [50]
DBus
dbus-dos-reply-time Check the reply time of a few D-Bus method calls while dbus-daemon is loaded by D-Bus traffic. Integrated NOT TESTED NOT TESTED NOT TESTED PASSED NOT TESTED PASSED PASSED PASSED andrewsh [51] [52] [53] [54]
Library modules
canterbury Run the automated test for the library: canterbury Integrated N/A N/A N/A NOT TESTED NOT TESTED N/A N/A NOT TESTED
didcot Run the automated test for the library: didcot Integrated N/A N/A N/A PASSED PASSED N/A N/A FAILED andrewsh [55] [56] [57]
frome Run the automated test for the library: frome Integrated N/A N/A N/A NOT TESTED NOT TESTED N/A N/A NOT TESTED
newport Run the automated test for the library: newport Integrated N/A N/A N/A PASSED PASSED N/A N/A PASSED andrewsh [58] [59] [60]
ribchester Run the automated test for the library: ribchester Integrated N/A N/A N/A NOT TESTED NOT TESTED N/A N/A NOT TESTED
rhosydd Run the automated test for the library: rhosydd Integrated N/A N/A N/A NOT TESTED NOT TESTED N/A N/A NOT TESTED
traprain Run the automated test for the library: traprain Integrated N/A N/A N/A NOT TESTED NOT TESTED N/A N/A NOT TESTED
Networking
bluez-avrcp-volume Test the AVRCP volume up and down commands. Not Integrated N/A N/A N/A PASSED PASSED N/A PASSED PASSED Sagar
bluez-phone Test all BlueZ features needing interaction with a phone (Pairing, OBEX, PBAP, AVRCP, A2DP, HSP, HFP, PAN). Not Integrated N/A N/A N/A PASSED PASSED N/A PASSED PASSED Sagar
bluez-setup Test setup of Bluetooth stack by running basic tests using hciconfig. Check if the interface can be brought up/down, can be changed of mode and can discover devices. Not Integrated N/A N/A N/A PASSED PASSED N/A PASSED PASSED Sagar
connman Runs some automated tests using the ConnMan D-Bus API. It guarantees most of the basic features are working. Integrated PASSED PASSED PASSED PASSED NOT TESTED PASSED PASSED PASSED andrewsh [61] [62] [63] [64] [65] [66] [67]
connman-new-supplicant Test the wpa_supplicant interface. Integrated NOT TESTED NOT TESTED NOT TESTED PASSED NOT TESTED PASSED PASSED PASSED andrewsh [68] [69] [70] [71]
connman-pan-tethering Test ConnMan support for PAN connectivity. Not Integrated N/A N/A N/A PASSED PASSED N/A PASSED PASSED Sagar
connman-pan-network-access Test ConnMan support for bluetooth PAN Network Access Profile. Not Integrated N/A N/A N/A PASSED PASSED N/A PASSED PASSED Sagar
connman-services Tests ConnMan services. Not Integrated N/A N/A N/A PASSED PASSED N/A PASSED PASSED Sagar
connman-usb-tethering Test ConnMan support for USB tethering (connection side). Not Integrated N/A N/A N/A PASSED PASSED N/A PASSED PASSED Sagar
ofono-sms-receive Test receiving SMS messages with oFono. Not Integrated N/A N/A N/A PASSED PASSED N/A PASSED PASSED Sagar
ofono-sms-send Test sending of SMS with oFono. Not Integrated N/A N/A N/A PASSED PASSED N/A PASSED PASSED Sagar
Folks
folks-alias-persistence Ensures user-set contact aliases persist. Integrated N/A N/A N/A FAILED FAILED N/A N/A FAILED andrewsh [72] [73] [74]
folks-eds-compatibility Checks that contacts created within Evolution Data Server (as will happen when phone contacts get synchronized to an Apertis machine) show up in other contact-based programs. Integrated N/A N/A N/A PASSED PASSED N/A N/A PASSED andrewsh [75] [76] [77]
folks-metacontacts-linking Ensures linking meta-contacts works properly. Integrated N/A N/A N/A FAILED FAILED N/A N/A FAILED andrewsh [78] [79] [80]
folks-metacontacts-unlinking Ensures unlinking meta-contacts works properly. Integrated N/A N/A N/A FAILED FAILED N/A N/A FAILED andrewsh [81] [82] [83]
folks-telepathy-retrieve-contacts Ensures that Folks can correctly retrieve Telepathy contacts. Integrated N/A N/A N/A FAILED FAILED N/A N/A FAILED andrewsh [84] [85] [86]
SDK Development
sdk-ide-build-run-program Creates a simple test project and confirms that compiling and executing work. Not Integrated N/A N/A N/A N/A N/A N/A N/A PASSED
Apparmor Basic
apparmor-basic-profiles Test basic apparmor profiles. Only parsing and syntax of profiles are tested for now. Integrated NOT TESTED NOT TESTED NOT TESTED PASSED NOT TESTED N/A N/A PASSED andrewsh [87] [88]
CGroups
cgroups-resource-control Run cgroup resource control tests Integrated NOT TESTED NOT TESTED NOT TESTED PASSED NOT TESTED PASSED PARTIAL PARTIAL andrewsh [89] [90] [91] [92]
SDK
sdk-performance-tools-gprof-smoke-test Checks basic gprof functionality by ensuring a CPU-intensive program shows up in its log as consuming the vast majority of the CPU cycles. Integrated N/A N/A N/A N/A N/A N/A N/A PASSED andrewsh [93]
sdk-performance-tools-sysprof-smoke-test Checks basic sysprof functionality by ensuring a CPU-intensive program shows up in its log as consuming the vast majority of the CPU cycles. Integrated N/A N/A N/A N/A N/A N/A N/A PASSED andrewsh [94]
sdk-debug-tools-gdb-smoke-test Checks basic gdb functionality by stopping a program at a set point and checking its backtrace matches expectations. Integrated N/A N/A N/A N/A N/A N/A N/A PASSED andrewsh [95]
sdk-debug-tools-strace-smoke-test Checks basic strace functionality by checking its output when run on a simple command line program. Integrated N/A N/A N/A N/A N/A N/A N/A PASSED andrewsh [96]
sdk-debug-tools-valgrind-smoke-test Checks basic valgrind functionality by running a program with and without memory leaks, ensuring expected results from valgrind. Integrated N/A N/A N/A N/A N/A N/A N/A PASSED andrewsh [97]
sdk-dbus-tools-bustle-smoke-test Test that bustle-dbus-monitor shows services on the session bus. Not Integrated N/A N/A N/A N/A N/A N/A N/A PASSED Sagar
sdk-dbus-tools-d-feet-smoke-test Test that D-Feet both shows services on the session bus and that new services appear automatically. Not Integrated N/A N/A N/A N/A N/A N/A N/A PASSED Sagar
sdk-code-analysis-tools-gcov-smoke-test Checks basic gcov functionality by running a sample program a few different ways and ensuring that a sufficient portion of its code paths are executed Integrated N/A N/A N/A N/A N/A N/A N/A PASSED andrewsh [98]
sdk-code-analysis-tools-splint-smoke-test Checks basic splint functionality by checking its output when run on a simple source file. Integrated N/A N/A N/A N/A N/A N/A N/A PASSED andrewsh [99]
sdk-vb-fullscreen Tests that the SDK VM can be fullscreened in VirtualBox Not Integrated N/A N/A N/A N/A N/A N/A N/A PASSED Sagar
Eclipse
eclipse-sysroot-management Test sysroot management and update within Eclipse. It will go through configuring an existing sysroot in Eclipse, and then updating it from the web with the latest version. Not Integrated N/A N/A N/A N/A N/A N/A N/A PARTIAL Sagar T4347
eclipse-install-to-target Test copying files to the remote device from within Eclipse. It will create a dummy project and then create a configuration to copy the binary file to a remote device and debug it remotely using Eclipse. Not Integrated N/A N/A N/A N/A N/A N/A N/A PARTIAL Sagar T4347
eclipse-remote-debugging Test remote debugging within Eclipse. It will create a dummy project and then create a configuration to copy the binary file to a remote device and debug it remotely using Eclipse. Not Integrated N/A N/A N/A N/A N/A N/A N/A PASSED Sagar
Contacts
evolution-sync-bluetooth Synchronizing Bluetooth-paired phone contacts to Evolution. Not Integrated N/A N/A N/A PASSED PASSED N/A PASSED PASSED Sagar
folks-metacontacts-antilinking Ensures anti-linking meta-contacts works properly. Integrated N/A N/A N/A FAILED FAILED N/A N/A FAILED andrewsh [100] [101] [102]
Connectivity
bluez-hfp Test Hands Free Profile (HFP) BlueZ feature. Not Integrated N/A N/A N/A PARTIAL PASSED N/A PASSED PASSED Sagar T3687
rfkill-toggle Test that rfkill is functional. Not Integrated N/A N/A N/A PASSED PASSED N/A PASSED PASSED Sagar
telepathy-ring Support making and receiving phone calls in Telepathy manually, with a bluetooth-paired phone. Not Integrated N/A N/A N/A PASSED PASSED N/A PASSED PASSED Sagar
telepathy-ring-automated Support making and receiving phone calls in Telepathy. Integrated N/A N/A N/A N/A N/A N/A N/A PASSED andrewsh [103]
Contacts
folks-ofono-backend Reading contacts from 3G modem SIM card. Not Integrated N/A N/A N/A PASSED PASSED N/A N/A PASSED Sagar
folks-search-contacts Ensures that Folks can correctly search contacts. Integrated N/A N/A N/A FAILED FAILED N/A N/A FAILED andrewsh [104] [105] [106]
abstract-contact-addressbook-creation A way to be able to create abstract addressbook is needed in SyncEvolution, so that separate addressbooks can be created for each paired device. Integrated N/A N/A N/A PASSED PASSED N/A N/A PASSED andrewsh [107] [108] [109]
folks-sync-only Test SYNCHRONIZE_ONLY flag for persona stores in Folks. Integrated N/A N/A N/A N/A N/A N/A N/A PASSED andrewsh [110]
storage-arbitrary-data-contacts Support for storing arbitrary data in contacts in Folks. Integrated N/A N/A N/A PASSED PASSED N/A N/A PASSED andrewsh [111] [112] [113]
Multimedia
webkit2gtk-gstreamer1.0 Tests html5 video playback with GStreamer 1.0 in WebKit2GTK Not Integrated N/A N/A N/A PASSED PASSED N/A PASSED PASSED Sagar
traffic-control-basic Test basic traffic control support. This test does not use tcmmd but it could catch missing support in the kernel or misbehaving traffic control. Not Integrated N/A N/A N/A PASSED PASSED N/A PASSED PASSED Sagar
traffic-control-tcmmd Test traffic control support with tcmmd and wget. Not Integrated N/A N/A N/A PASSED PASSED N/A PASSED PASSED Sagar
traffic-control-tcdemo Test traffic control demo with tcmmd and tcdemo. Not Integrated N/A N/A N/A PASSED PASSED N/A PASSED PASSED Sagar
gstreamer-splash Test whether the gstreamer splash plugin is working. Not Integrated N/A N/A N/A PARTIAL N/A N/A N/A N/A Sagar T4322
video-animation-on-boot Test whether Plymouth is able to display a graphical theme. Not Integrated N/A N/A N/A FAILED PASSED FAILED PASSED PASSED Sagar T4322
Robustness
glib-gio-fs Run the GLib gio tests that do I/O on the local filesystem. Integrated PASSED PASSED PASSED PASSED NOT TESTED PASSED PASSED PASSED andrewsh [114] [115] [116] [117] [118] [119] [120]
sqlite-veryquick Run the "veryquick" tests shipped with SQLite. Integrated N/A N/A N/A NOT TESTED NOT TESTED N/A N/A NOT TESTED
Security
apparmor Functional testing for AppArmor functionalities. Integrated NOT TESTED NOT TESTED NOT TESTED PARTIAL NOT TESTED N/A N/A PARTIAL andrewsh [121] [122]
apparmor-chaiwala-system Test that AppArmor's system wide rules works according to Apertis security goals. Integrated NOT TESTED NOT TESTED NOT TESTED PASSED NOT TESTED N/A N/A PASSED andrewsh [123] [124]
apparmor-functional-demo Show some main AppArmor functionalities, like transitions, net access or resource permissions, under the form of tests. Integrated NOT TESTED NOT TESTED NOT TESTED PASSED NOT TESTED N/A N/A PASSED andrewsh [125] [126]
apparmor-utils Test apparmor_parser and other tools in apparmor package can be executed. Integrated NOT TESTED NOT TESTED NOT TESTED PASSED NOT TESTED N/A N/A PASSED andrewsh [127] [128]
apparmor-session-lockdown-no-deny Test that the session lockdown profile is not blocking more than it should Integrated NOT TESTED NOT TESTED NOT TESTED NOT TESTED NOT TESTED N/A N/A NOT TESTED
apparmor-gstreamer1.0 Test that AppArmor profiles provided in GStreamer 1.0 works without Auditd complaining Integrated NOT TESTED NOT TESTED NOT TESTED FAILED NOT TESTED N/A N/A FAILED andrewsh [129] [130]
apparmor-pulseaudio Test that AppArmor profiles provided in PulseAudio 2.1 work without Auditd complaining. Integrated NOT TESTED NOT TESTED NOT TESTED PASSED NOT TESTED N/A N/A PARTIAL andrewsh [131] [132]
apparmor-bluez-automated Test AppArmor profile for support for SPP profile (bluez-spp) and core functionalities (bluez-core). Not Integrated N/A N/A N/A PASSED PASSED N/A PASSED N/A Sagar
apparmor-bluez-avrcp-volume Test AppArmor profile for Bluez AVRCP volume up and down commands. Not Integrated N/A N/A N/A PASSED PASSED N/A PASSED N/A Sagar
apparmor-bluez-setup Test AppArmor profiles for setting up of Bluetooth stack by running basic tests using hciconfig. Check if the interface can be brought up/down, can be changed of mode and can discover devices. Not Integrated N/A N/A N/A PASSED PASSED N/A PASSED N/A Sagar
apparmor-folks Test that AppArmor profiles provided in Folks package work without unexpected auditd log entries. Integrated NOT TESTED NOT TESTED NOT TESTED FAILED NOT TESTED N/A N/A PARTIAL andrewsh [133] [134]
apparmor-geoclue Test that geoclue apparmor profiles are working properly Integrated NOT TESTED NOT TESTED NOT TESTED PASSED NOT TESTED N/A N/A PASSED andrewsh [135] [136]
apparmor-ofono Test that AppArmor profiles provided in ofono package work without unexpected auditd log entries. Not Integrated N/A N/A N/A PASSED PASSED N/A PASSED N/A Sagar
apparmor-tracker Tests that the tracker abstraction and tracker profiles don't cause false negatives and that it does not allow arbitrary reading of files in the home directory. Integrated NOT TESTED NOT TESTED NOT TESTED FAILED NOT TESTED N/A N/A PARTIAL andrewsh [137] [138]
apparmor-tumbler Tests that the tumbler profile doesn't cause false negatives and that it does not allow arbitrary reading of files in the home directory. Integrated NOT TESTED NOT TESTED NOT TESTED PASSED NOT TESTED N/A N/A PASSED andrewsh [139] [140]
iptables-basic Test the firewall automatically. Integrated FAILED PASSED FAILED PASSED NOT TESTED PASSED PASSED PASSED andrewsh [141] [142] [143] [144] [145] [146] [147]
iptables-nmap Test the firewall using nmap from another computer. Not Integrated N/A N/A N/A PASSED PASSED N/A N/A PASSED Sagar
apparmor-dbus Functional testing for AppArmor D-Bus mediation. Integrated NOT TESTED NOT TESTED NOT TESTED PASSED NOT TESTED N/A N/A PASSED andrewsh [148] [149]
System Update
last-resort-message Test whether U-Boot last resort image is displayed on boot failure Not Integrated N/A N/A N/A FAILED N/A N/A N/A N/A Sagar T4326
boot-performance Test boot performance. Not Integrated N/A N/A N/A FAILED FAILED FAILED FAILED N/A Sagar T4332
boot-performance-automated Test boot performance. Integrated PASSED PASSED PASSED PASSED NOT TESTED PASSED PASSED PASSED andrewsh [150] [151] [152] [153] [154] [155] [156]
Webkit
webkit2gtk-aligned-scroll Test that scrolling is pinned in a given direction when started mostly towards it. Not Integrated N/A N/A N/A FAILED FAILED N/A FAILED N/A Sagar T4243
webkit2gtk-lazy-click Test touch adjustment (lazy click) support in WebKit2GTK Not Integrated N/A N/A N/A PASSED PASSED N/A PASSED PASSED Sagar
webkit2gtk-drag-and-drop Test HTML5 drag-and-drop support in WebKit2GTK Not Integrated N/A N/A N/A PASSED PASSED N/A PASSED PASSED Sagar
webkit2gtk-contextual-zoom This test case is about zooming parts of a web page to make it easier to read on devices with limited screen area. The scope of the test is the zooming functionality that takes into account the content in the clicked area, other functionality that belongs to a real browser isn't to be tested here. Not Integrated N/A N/A N/A FAILED FAILED N/A FAILED FAILED Sagar T4244
PASSED - All tests passed.
PARTIAL - Tests mostly passed, with some minor problems.
FAILED - One or more tests failed.
NOT TESTED - Test not run due to some issue, like WIP, Disabled, lacking proper hardware.
Personal tools
Namespaces

Variants
Actions
Navigation
Tools