17.12/ReleaseNotes

From Apertis
Jump to: navigation, search

Contents

Apertis 17.12 Release

17.12 is the current stable development release of Apertis, a Debian/Ubuntu derivative distribution geared towards the creation of product-specific images for ARM (both in the 32bit ARMv7 version using the hardfloat ABI and in the 64-bit ARMv8 version) and Intel x86-64 (64-bit) systems.

This Apertis release is based on top of the Ubuntu 16.04 (Xenial) LTS release with several customization. Test results of the 17.09 release are available in the 17.12 test report.

Release downloads

Apertis 17.12 images
Intel 64-bit Intel 64 bit Minimal Image Intel 64 bit Target Image Intel 64 bit Development Image Intel 64 bit SDK Image
ARM 32-bit ARM 32 bit Minimal Image
ARM 64-bit ARM 64 bit Minimal Image

The Intel minimal, target and development images are tested on the reference hardware (MinnowBoard MAX), but they can run on any UEFI-based x86-64 system. The sdk image is tested under VirtualBox.

Apertis 17.12 repositories

 $ deb https://repositories.apertis.org/apertis/ 17.12 target helper-libs development sdk hmi

New features

ARM 64 bit support

Support for the ARM 64 bit (AArch64) architecture has been added to the regularly built set of images, focusing on the minimal variant.

LXC template

A new template script for LXC is now available to make instantiating LXC containers based on Apertis as simple as possible:

sudo lxc-create -t $PWD/apertis-image-recipes/lxc/lxc-apertis-ostree --name apertis-test \
  -- --ospack https://images.apertis.org/lxc/17.12/20171221.0/lxc-ostree-17.12-amd64-minimal_20171221.0.tar.gz
sudo lxc-start -F --name apertis-test

New image building pipeline based on debos

A completely new infrastructure to build the Apertis images, ospacks, and sysroots has now been put into production. The previous setup based on cb_build has been replaced by new pipelines based on debos, which provides more flexibility in customizing each image variant for the specific task at hand and does so with YAML-based recipes which are significantly easier to understand and modify than the shell-based configuration setup used by the previous toolchain.

Merged /usr support

Apertis now supports running in a setup where the filesystem hierarchy has been merged under /usr, making easier for platform developers to isolate the read-only parts of the operating system from the writable runtime data.

Preliminary OSTree support

Support for OSTree-based deployments is being progressively introduced. OSTree repositories are currently populated as a step in the new image-building pipeline. The previously mentioned LXC containers templates already make use of them, providing robust, autonomous upgrades to the instantiated containers.

Migration to LAVAv2

With the end of the LAVAv1 development, the Apertis infrastructure has been switched to LAVAv2. This has brough

Groundwork

Testcases clean up

The set of testcases being regularly run has been pruned of some old, no longer relevant entries, to free resources to run tests on all supported image variants.

Merge-our-misc

The Merge-our-misc instance feeding updates from Ubuntu LTS has been reactivated and configured on a dedicated host.

Design and documentation

IDC Connectivity domain

The Inter-Domain Communication design document has been extended to describe setups including a Connectivity domain, used by Automotive domains to increase the isolation of network-facing services.

Deprecations and ABI/API breaks

Deprecations

During this release cycle we have continued to mark obsolete or problematic APIs with the ABI break tag as a way to clear technical debt in future.

Mildenhall UI framework

The Mildenhall UI toolkit is deprecated in favour of other UI toolkits such as GTK+, Qt, or HTML5-based solutions
From the next release Apertis may no longer ship the Mildenhall UI toolkit nor any accompanying libraries, as the underlying Clutter library has been deprecated upstream for some years now.

Application framework

ribchester-full and canterbury-full are deprecated
From the next release Canterbury and Ribchester will only offer the APIs provided by the respective -core and the additional APIs offered by the -full packages will be dropped

Breaks

LAVAv1 test job definitions are no longer supported
Test job definitions using the JSON-based LAVAv1 syntax are no longer supported and have been replaced by the LAVAv2 syntax based on YAML and Jinja2 templating.

Rollback mechanism no longer available
The incomplete upgrade and rollback mechanism for system updates based on Btrfs subvolumes has been dropped for this release. A more robust and flexible mechanism based on OSTree is planned for the coming releases.

Infrastructure

Apertis infrastructure tools

For Debian Jessie based systems:

 $ deb https://repositories.apertis.org/debian/ jessie tools

For Ubuntu Trusty based systems:

 $ deb https://repositories.apertis.org/ubuntu/ trusty tools

Images

Image daily builds, as well as release builds can be found at:

 https://images.apertis.org/

Image build tools can be found in the Apertis tools repositories.

Known issues

High (3)

  • T4391 Cross-compiling fails using ADE on AMD64 SDK
  • T4389 Remove bash version 4.3 from arm images
  • T4402 check-dbus-services: Navigation and Traprain tests fail for SDK image

Normal (134)

  • T4429 Harbormaster always fail with commit message error
  • T4426 check-dbus-services: Error: GDBus.Error:org.freedesktop.DBus.Error.AccessDenied
  • T4424 apparmor-pulseaudio: pulseaudio.normal.expected_underlying_tests fails
  • T4423 frome: `/tmp/frome-*': No such file or directory
  • T4422 do-branching fails at a late stage cloning OBS binary repos
  • T4421 ribchester: Job for generated-test-case-ribchester.service canceled
  • T4420 canterbury: core-as-root and full-as-root tests failed
  • T4419 traprain: sadt: error: cannot find debian/tests/control
  • T4414 No music and Video files are present in the image
  • T4409 tracker-indexing-mass-storage test case fails
  • T4407 boot-no-crashes: ANOM_ABEND found in journalctl logs
  • T4399 dbus-installed-tests: service failed because a timeout was exceeded
  • T4397 sqlite: Many tests fail for target amd64, armhf and sdk
  • T4396 didcot: test_open_uri: assertion failed
  • T4395 tracker-indexing-local-storage: AssertionError: False is not true
  • T4394 gupnp-services: browsing and introspection tests fail
  • T4392 apparmor-gstreamer1.0: gstreamer1.0-decode: assertion failed
  • T4390 apparmor-folks: Several tests fail
  • T4387 apparmor: /usr/lib/apparmor/tests/environ fails
  • T4386 apparmor-tracker: AssertionError: False is not true
  • T4384 folks-search-contacts: folks-search-contacts_sh.service failed
  • T4383 folks-metacontacts-antilinking: folks-metacontacts-antilinking_sh.service failed
  • T4381 folks-alias-persistence: folks-alias-persistence_sh.service failed
  • T4380 folks-telepathy: folks-retrieve-contacts-telepathy_sh.service failed
  • T4379 folks-metacontacts: folks-metacontacts-linking_sh.service failed
  • T4334 Need vim.tiny and scp packages to be pre-installed as part of the target minimal images
  • T4332 Boot chart doesn't get generated
  • T4326 Blank screen seen on executing last-resort-message testcase
  • T4325 Building cargo and rustc in 17.12 for Firefox Quantum 57.0
  • T4322 No splashscreen on boot
  • T4312 Volume Control application hangs on opening it
  • T4308 Debos: changes 'resolv.conf' during commands execution chroot
  • T4307 ribchester-core causes apparmor denies on non-btrfs minimal image
  • T4306 Debos: option for kernel command parameters for 'filesystem-deplay' action
  • T4305 Debos: mountpoints which are mounted only in build time
  • T4303 Debos: allow to use partition number for 'raw' action
  • T4293 Preseed action is needed for Debos
  • T4244 zoom feature is not working as expected
  • T4243 Segmentation fault occurs while exectuing webkit2gtk-aligned-scroll test case
  • T4242 gnutls depends on old abandoned package gmp4 due to licensing reasons
  • T4142 introspectable support for GObject property, signal and methods
  • T4110 Crash observed on seed module when we accesing the D-Bus call method
  • T4092 Containers fail to load on Gen4 host
  • T4089 Crash observed on webruntime framework
  • T4087 Incorrect network available state shown in GNetworkMonitor
  • T4063 Observing multiple service instances in all 17.06 SDK images
  • T4056 Frampton application doesn't load when we re-launch them after clicking the back button
  • T4052 Rendering issue observed on websites like http://www.moneycontrol.com
  • T4050 Render theme buttons are not updating with respect to different zoom levels
  • T4048 HTML5 demo video's appear flipped when played on webkit2 based browser app
  • T4046 Page rendering is not smooth in sites like www.yahoo.com
  • T4031 Mildenhall should install themes in the standard xdg data dirs
  • T4027 webkit2GTK crash observed flicking on webview from other widget
  • T4005 Newport test fails on minimal images
  • T3996 Avoid unconstrained dbus AppArmor rules in frome
  • T3992 Steps like pattern is seen in the background in songs application
  • T3991 virtual keyboard is not showing for password input field of any webpage
  • T3980 Shutdown not working properly in virtualbox
  • T3973 bredon-0-launcher should be shipped in its own package, not in libbredon-0-1"
  • T3972 webview-test should be shipped in libbredon-0-tests instead of libbredon-0-1
  • T3971 libbredon/seed uninstallable on target as they depend on libraries in :development
  • T3970 Mismatching gvfs/gvfs-common and libatk1.0-0/libatk1.0-data package versions in the archive
  • T3969 MildenhallSelPopupItem model should be changed to accept only gchar * instead of MildenhallSelPopupItemIconDetail for icons
  • T3965 Rhosydd service crashes when client exits on some special usecases (Refer description for it)
  • T3955 rhosydd-client crashes when displaying vehicle properties for mock backend
  • T3940 libmildenhall-0-0 contains files that would conflict with a future libmildenhall-0-1
  • T3939 libshoreham packaging bugs
  • T3920 arm-linux-gnueabihf-pkg-config does not work with sysroots installed by `ade`
  • T3909 MildenhallSelectionPopupItem doesn't take ownership when set properties
  • T3798 In mildenhall, URL history speller implementation is incomplete.
  • T3797 Variable roller is not working
  • T3763 Compositor hides the other screens
  • T3759 Status bar is not getting updated with the current song/video being played
  • T3730 canterbury: Most of the tests fail
  • T3729 ribchester: gnome-desktop-testing test times out
  • T3728 rhosydd: integration test fails
  • T3727 didcot-client: autopkgtest fails with org.apertis.Didcot.Error.NoApplicationFound and ""Unit didcot.service could not be found""
  • T3724 GtkClutterLauncher: Segfaults with mouse right-clicking
  • T3694 Cross debugging through GDB and GDBserver Not possible.
  • T3687 Voice/Audio is not heard for the Bluez-hfp profile in i.MX6
  • T3677 Deploying LAVA tests for SDK images on personal stream fails
  • T3647 The web runtime doesn't set the related view when opening new windows
  • T3631 Segmentation fault when disposing test executable of mildenhall
  • T3588 <abstractions/chaiwala-base> gives privileges that not every app-bundle should have
  • T3580 Canterbury entry-point launching hides global popups, but only sometimes
  • T3569 Album art is missing in one of the rows of the songs application
  • T3568 folks: random tests fail
  • T3564 GLib, GIO Reference Manual links are incorrectly swapped
  • T3563 GObject Generator link throws 404 error
  • T3552 Search feature doesn't work correctly for appdev portal located at https://appdev.apertis.org/documentation/index.html
  • T3537 cgroups-resource-control: test network-cgroup-prio-class failed
  • T3517 webview Y offset not considered to place, full screen video on youtube webpage
  • T3506 Confirm dialog status updated before selecting the confirm option YES/NO
  • T3474 gupnp-services tests test_service_browsing and test_service_introspection fail on target-arm image
  • T3331 telepathy-gabble-tests should depend on python-dbus
  • T3321 libgles2-vivante-dev is not installable
  • T3319 mx6qsabrelite: linking issue with libgstimxeglvivsink.so and libgstimxvpu.so gstreamer plugins
  • T3292 apparmor-folks: unable to link contacts to test unlinking
  • T3291 tracker tests: Error creating thumbnails: No poster key found in metadata
  • T3280 Cannot open links within website like yahoo.com
  • T3248 polkit-parsing: TEST_RESULT:fail
  • T3237 make check fails on libbredon package for wayland warnings
  • T3233 Ribchester: deadlock when calling RemoveApp() right after RollBack()
  • T3219 Canterbury messes up kerning when .desktop uses unicode chars
  • T3218 VirtualBox freezes using 100% CPU when resuming the host from suspend
  • T3217 VirtualBox display freezes when creating multiple notifications at once and interacting (hover and click) with them
  • T3189 apparmor-tracker: underlying_tests failed
  • T3187 tracker-indexing-local-storage: Stopping tracker-store services
  • T3174 Clang package fails to install appropriate egg-info needed by hotdoc
  • T3171 Unusable header in Traprain section in Devhelp
  • T3121 Test apps are failing in Liblightwood with the use of GTest
  • T2995 Focus in launcher rollers broken because of copy/paste errors
  • T2986 Mismatch between server version file and sysroot version
  • T2946 Pulse Audio volume control doesn't launch as a separate window on SDK
  • T2896 Crash when initialising egl on ARM target
  • T2861 gupnp-services: test service failed
  • T2858 "shapwick reads /etc/nsswitch.conf and /etc/passwd
  • T2857 factory reset with a different image's rootfs.tar.gz results in emergency mode
  • T2853 GStreamer playbin prioritises imxeglvivsink over clutterautovideosink
  • T2850 Fix folks EDS tests to not be racy
  • T2833 Interaction with PulseAudio not allowed by its AppArmor profile
  • T2782 libsoup-unit: ssl-test failed for ARM
  • T2718 telepathy-gabble: Several tests failed
  • T2635 minimal image: DISPLAY sanity check tests failed
  • T2593 Unsupported launguage text is not shown on the page in GtkClutterLauncher
  • T2550 Target doesn't reboot after system update
  • T2474 cgroups-resource-control: blkio-weights tests failed
  • T2318 mildenhall-settings: does not generate localization files from source
  • T2317 libgrassmoor: executes tracker-control binary
  • T2239 factory-reset-tool TC: flagcheck messages are hidden by Plymouth
  • T2224 apparmor-libreoffice: libreoffice.normal.expected fails: ods_to_pdf: fail [Bugzilla bug #331]
  • T1960 remove INSTALL, aclocal.m4 files from langtoft
  • T1556 No connectivity Popup is not seen when the internet is disconnected.
  • T1361 Not able to load heavy sites on GtkClutterLauncher

Low (45)

  • T4348 Inital Roller mappings are misaligned on the HMI
  • T4296 Segmentation fault is observed on closing the mildenhall-compositor
  • T4168 On first flashing of the image any second application does not get displayed (eg. album art)
  • T4166 On multiple re-entries from settings to eye the compositor hangs
  • T4010 connman: patch ""device: Don't report EALREADY"" not accepted upstream
  • T4009 connman: patch ""Use ProtectSystem=true"" rejected upstream
  • T3771 Roller problem in settings application
  • T3770 Songs do not start playing from the beginning but instead start a little ahead
  • T3769 Blank screen seen in Songs application on re-entry
  • T3595 qemu-arm-static not found in the pre installed qemu-user-static package
  • T3433 Resizing the window causes page corruption
  • T3431 Content on a webpage doesn't load in sync with the scroll bar
  • T3430 Spacing issues between text and selection box in website like amazon
  • T3332 Compositor seems to hide the bottom menu of a webpage
  • T3183 gstreamer1-0-decode: Failed to load plugin warning
  • T3164 Album Art Thumbnail missing in Thumb view in ARTIST Application
  • T3161 "If 2 drawers are activated, the most recent one hides behind the older one, instead of coming on top of older one.
  • T3008 beep audio decoder gives errors continously
  • T2917 Images for the video links are not shown in news.google.com on GtkClutterLauncher
  • T2905 Context drawer displced when switching to fullscreen in browser app
  • T2892 Printing hotdoc webpage directly results in misformatted document
  • T2890 Zoom in feature does not work on google maps
  • T2889 Cannot open/view pdf documents in browser (GtkClutterLauncher)
  • T2885 Drop down lists are not working on a site like facebook
  • T2790 Background video is not played in some website with GtkClutterLauncher
  • T2788 "Share links to facebook, twitter are nbt working in browser (GtkClutterLauncher)
  • T2785 The background HMI is blank on clicking the button for Power OFF
  • T2781 Horizontal scroll is not shown on GtkClutterLauncher
  • T2704 The video player window is split into 2 frames in default view
  • T2560 Back option is missing as part of the tool tip
  • T2501 Bluetooth pairing option not working as expected
  • T2498 Simulator screen is not in center but left aligned
  • T2483 Video doesn't play when toggling from full screen to detail view
  • T2475 Theme ,any F node which is a child of an E node is not working for Apertis widgets.
  • T2367 Videos are hidden when Eye is launched
  • T2332 bluetooth device pair failing with ""Invalid arguments in method call"""
  • T2299 Clutter_text_set_text API redraws entire clutterstage
  • T2235 mxkineticscrollview-smooth-pan:Free scroll doesn't work
  • T2226 Network search pop-up isn't coming up in wi-fi settings
  • T2142 Power button appers to be disabled on target
  • T2028 Documentation is not available from the main folder
  • T1964 Mildenhall compositor crops windows
  • T2787 Only half of the hmi is covered when opening gnome.org
  • T1809 Upstream: linux-tools-generic should depend on lsb-release
  • T789 Remove unnecessary folks package dependencies for automated tests

Lowest (2)

  • T4047 Broken HTML generation in Backworth for the developers portal website
  • T4023 Failed to load Captcha in Apertis developer portal
Personal tools
Namespaces

Variants
Actions
Navigation
Tools