17.06/TestReports/20170621

From Apertis
Jump to: navigation, search

Testing results considerations:

  1. Manual test cases were executed on target ARM, target AMD64 and SDK AMD64 images when applicable.
  2. All automated test cases already integrated into LAVA system were executed on the following images: target ARM, target AMD64, development AMD64, and SDK AMD64.
  3. Failures and partial failures were filed as bugs in Phabricator for further investigation and analysis.



The platform image used for these tests are:

ID Description Type Target ARM Target AMD64 Development AMD64 SDK AMD64 Tested By Notes
Sanity
sanity-check Check that the Apertis system basically works. (manual) Not Integrated PASSED PASSED PASSED PASSED Vijeth Murali Sagar
sanity-check Check that the Apertis system basically works. (automated) Integrated PASSED PASSED PASSED PASSED andrewsh [1] [2] [3] [4]
Booting
image-bootable Test whether the image is bootable. Not Integrated PASSED PASSED PASSED PASSED Vijeth Murali Sagar
image-gui-start Test whether the image starts a graphical environment. Not Integrated PASSED PASSED PASSED PASSED Vijeth Murali Sagar
HW Acceleration
x-hw-accelerated Test whether the correct GLES2 render is used. Not Integrated N/A N/A N/A PASSED Vijeth
GStreamer
clutter-playback-gstreamer1.0 Test video and audio playback using clutter-gst and GStreamer1.0. Not Integrated PASSED PASSED PASSED PASSED Vijeth Murali Sagar T1964
gstreamer1.0-decode Test video and audio decoders and demuxers on a list of media. Integrated NOT TESTED PASSED PASSED NOT TESTED andrewsh [5] [6]
Multitouch
clutter-actors-bigger-reactive-area Test that Clutter allows an actor's pick area to be larger than its paint area. Not Integrated PASSED PASSED PASSED PASSED Vijeth Murali Sagar
clutter-mt-rotate Test that clutter properly performs rotation gestures. Not Integrated PASSED PASSED PASSED PASSED Vijeth Murali Sagar
clutter-mt-touch-events Test multi-touch support in Clutter. Not Integrated PASSED PASSED PASSED PASSED Vijeth Murali Sagar
clutter-mt-zoom Test that clutter properly performs zoom gestures. Not Integrated PASSED PASSED PASSED PASSED Vijeth Murali Sagar
clutter-transparent-stage Test that clutter transparent stages are correctly handled by the graphics stack. Not Integrated PASSED PASSED PASSED N/A Vijeth Murali Sagar
webkit-mt-touch-events Test implementation of W3C touch events API in webkit-clutters. Not Integrated PASSED PASSED PASSED PASSED Vijeth Murali Sagar
xephyr-mt-touch-events Test that X clients within Xephyr receive touch events forwarded from the host X display.

This test is used for both touchscreen *and* support for the Magic Trackpad. So please, do test for both cases below:

Not Integrated N/A N/A N/A PASSED Vijeth
WebKit
webkit-actor-tiles Test implementation of actor-based tiled backing store in webkit-clutter. Not Integrated PASSED PASSED PASSED PASSED Vijeth Murali Sagar
webkit-event-handling-redesign Test WebKit-Clutter ability to scroll by touch with inertial behaviour after the touch ended. Not Integrated PASSED PASSED PASSED PASSED Vijeth Murali Sagar
Webkit-AC
webkit-ac-3d-rendering Test that 3D transforms are applied correctly. Not Integrated PASSED PASSED PASSED PASSED Vijeth Murali Sagar
webkit-ac-animations Test that Clutter actors created for representing layers animate properly. Not Integrated PASSED PASSED PASSED PASSED Vijeth Murali Sagar
webkit-ac-scrolling Test that actors created for representing layers scroll properly. Not Integrated PASSED PASSED PASSED PASSED Vijeth Murali Sagar
Gettext
clutter-i18n-gettext Check that internationalization (translation) of Clutter applications using gettext works. Not Integrated PASSED PASSED PASSED PASSED Vijeth Murali Sagar
gettext-i18n Check that gettext internationalization works. Integrated NOT TESTED PASSED PASSED NOT TESTED andrewsh [7] [8]
Meta Data Management
gupnp-services Run a few tests related to service browsing, introspection, etc. Integrated NOT TESTED PARTIAL PASSED NOT TESTED andrewsh [9] [10]
librest-unit Run the unit tests that ship with the library against the running system. Integrated NOT TESTED PARTIAL PARTIAL NOT TESTED andrewsh [11] [12]
libsoup-unit Run the unit tests that ship with the library against the running system. Integrated NOT TESTED PASSED PASSED NOT TESTED andrewsh [13] [14]
tracker-indexing-local-storage Check tracker indexing of local storage and journal behaviour. Integrated NOT TESTED FAILED FAILED NOT TESTED andrewsh [15] [16]
tracker-indexing-mass-storage Check tracker indexes mass storage devices on insertion. Not Integrated PASSED PASSED PASSED PASSED Vijeth Murali Sagar
tumbler-thumbnailing Check that all thumbnailing features of tumbler are working properly (large, small, videos, documents, images). Integrated NOT TESTED PASSED FAILED NOT TESTED andrewsh [17] [18]
Grilo
grilo Check grilo metadata notifications, and filesystem browsing. Integrated NOT TESTED PASSED PASSED NOT TESTED andrewsh [19] [20]
DBus
dbus-dos-reply-time Check the reply time of a few D-Bus method calls while dbus-daemon is loaded by D-Bus traffic. Integrated NOT TESTED PASSED PASSED NOT TESTED andrewsh [21] [22]
Networking
bluez-avrcp-volume Test the AVRCP volume up and down commands. Not Integrated PASSED PASSED PASSED PASSED Vijeth Murali Sagar
bluez-phone Test all BlueZ features needing interaction with a phone (Pairing, OBEX, PBAP, AVRCP, A2DP, HSP, HFP, PAN). Not Integrated PASSED PASSED PASSED PASSED Vijeth Murali Sagar
bluez-setup Test setup of Bluetooth stack by running basic tests using hciconfig. Check if the interface can be brought up/down, can be changed of mode and can discover devices. Not Integrated PASSED PASSED PASSED PASSED Vijeth Murali Sagar
connman Runs some automated tests using the ConnMan D-Bus API. It guarantees most of the basic features are working. Integrated NOT TESTED PASSED PASSED NOT TESTED andrewsh [23] [24]
connman-new-supplicant Test the wpa_supplicant interface. Integrated NOT TESTED PASSED PASSED NOT TESTED andrewsh [25] [26]
connman-pan-tethering Test ConnMan support for PAN connectivity. Not Integrated PASSED PASSED PASSED PASSED Vijeth Murali Sagar
connman-pan-network-access Test ConnMan support for bluetooth PAN Network Access Profile. Not Integrated PASSED PASSED PASSED PASSED Vijeth Murali Sagar
connman-services Tests ConnMan services. Not Integrated PASSED PASSED PASSED PASSED Vijeth Murali Sagar
connman-usb-tethering Test ConnMan support for USB tethering (connection side). Not Integrated PASSED PASSED PASSED PASSED Vijeth Murali Sagar
ofono-sms-receive Test receiving SMS messages with oFono. Not Integrated PASSED PASSED PASSED PASSED Vijeth Murali Sagar
ofono-sms-send Test sending of SMS with oFono. Not Integrated PASSED PASSED PASSED PASSED Vijeth Murali Sagar
newport-service Test the Newport service (download manager) Not Integrated PASSED PASSED PASSED PASSED Vijeth Murali Sagar
Folks
folks-alias-persistence Ensures user-set contact aliases persist. Integrated NOT TESTED PARTIAL PARTIAL NOT TESTED andrewsh [27] [28]
folks-eds-compatibility Checks that contacts created within Evolution Data Server (as will happen when phone contacts get synchronized to an Apertis machine) show up in other contact-based programs. Integrated NOT TESTED PASSED PASSED NOT TESTED andrewsh [29] [30]
folks-metacontacts-linking Ensures linking meta-contacts works properly. Integrated NOT TESTED PARTIAL PARTIAL NOT TESTED andrewsh [31] [32]
folks-metacontacts-unlinking Ensures unlinking meta-contacts works properly. Integrated NOT TESTED PARTIAL PARTIAL NOT TESTED andrewsh [33] [34]
folks-telepathy-retrieve-contacts Ensures that Folks can correctly retrieve Telepathy contacts. Integrated NOT TESTED PARTIAL PARTIAL NOT TESTED andrewsh [35] [36]
Telepathy
telepathy-gabble-unit Run telepathy-gabble test suite. Integrated NOT TESTED FAILED FAILED NOT TESTED andrewsh [37] [38]
telepathy-rakia Test Telepathy rakia integration Not Integrated PASSED PASSED PASSED PASSED Vijeth Murali Sagar
SDK Development
sdk-ide-build-run-program Creates a simple test project and confirms that compiling and executing work. Not Integrated N/A N/A N/A PASSED Vijeth
sdk-nested-wm Tests that Devilspie scripts can be applied to windows running within Mutter. Not Integrated N/A N/A N/A PASSED Vijeth
Apparmor Basic
apparmor-basic-profiles Test basic apparmor profiles. Only parsing and syntax of profiles are tested for now. Integrated PASSED PASSED PASSED NOT TESTED andrewsh [39] [40] [41]
CGroups
cgroups-resource-control Run cgroup resource control tests Integrated NOT TESTED PASSED PASSED NOT TESTED andrewsh [42] [43]
SDK
sdk-performance-tools-gprof-smoke-test Checks basic gprof functionality by ensuring a CPU-intensive program shows up in its log as consuming the vast majority of the CPU cycles. Integrated N/A N/A N/A PASSED andrewsh [44]
sdk-performance-tools-sysprof-smoke-test Checks basic sysprof functionality by ensuring a CPU-intensive program shows up in its log as consuming the vast majority of the CPU cycles. Integrated N/A N/A N/A PASSED andrewsh [45]
sdk-debug-tools-gdb-smoke-test Checks basic gdb functionality by stopping a program at a set point and checking its backtrace matches expectations. Integrated N/A N/A N/A PASSED andrewsh [46]
sdk-debug-tools-strace-smoke-test Checks basic strace functionality by checking its output when run on a simple command line program. Integrated N/A N/A N/A PASSED andrewsh [47]
sdk-debug-tools-valgrind-smoke-test Checks basic valgrind functionality by running a program with and without memory leaks, ensuring expected results from valgrind. Integrated N/A N/A N/A PASSED andrewsh [48]
sdk-dbus-tools-bustle-smoke-test Test that bustle-dbus-monitor shows services on the session bus. Not Integrated N/A N/A N/A PASSED Vijeth
sdk-dbus-tools-d-feet-smoke-test Test that D-Feet both shows services on the session bus and that new services appear automatically. Not Integrated N/A N/A N/A PASSED Vijeth
sdk-code-analysis-tools-gcov-smoke-test Checks basic gcov functionality by running a sample program a few different ways and ensuring that a sufficient portion of its code paths are executed Integrated N/A N/A N/A PASSED andrewsh [49]
sdk-code-analysis-tools-splint-smoke-test Checks basic splint functionality by checking its output when run on a simple source file. Integrated N/A N/A N/A PASSED andrewsh [50]
sdk-vb-fullscreen Tests that the SDK VM can be fullscreened in VirtualBox Not Integrated N/A N/A N/A PASSED Vijeth
Eclipse
eclipse-sysroot-management Test sysroot management and update within Eclipse. It will go through configuring an existing sysroot in Eclipse, and then updating it from the web with the latest version. Not Integrated N/A N/A N/A PASSED Vijeth
eclipse-install-to-target Test copying files to the remote device from within Eclipse. It will create a dummy project and then create a configuration to copy the binary file to a remote device and debug it remotely using Eclipse. Not Integrated N/A N/A N/A PASSED Vijeth
eclipse-remote-debugging Test remote debugging within Eclipse. It will create a dummy project and then create a configuration to copy the binary file to a remote device and debug it remotely using Eclipse. Not Integrated N/A N/A N/A PASSED Vijeth
Contacts
evolution-sync-bluetooth Synchronizing Bluetooth-paired phone contacts to Evolution. Not Integrated PASSED PASSED PASSED PASSED Vijeth Murali Sagar
folks-metacontacts-antilinking Ensures anti-linking meta-contacts works properly. Integrated NOT TESTED PARTIAL PARTIAL NOT TESTED andrewsh [51] [52]
Clutter Multitouch
xoo-soft-keys-emulation Test that 'xoo' allows one to pass-in Xephyr-nested key events from clicking UI buttons Integrated N/A N/A N/A NOT TESTED
clutter-performance Test performance of Clutter Integrated NOT TESTED PASSED PASSED PASSED andrewsh [53] [54] [55]
mxkineticscrollview-smooth-pan Some low-resolution touch screens send touch events in widely separate time intervals, which causes MxKineticScrollView widget to jump from one position to the next one without any visible transition. This test case implements a long list to scroll through to make sure there are no visible "jumps" when scrolling. Not Integrated PARTIAL PARTIAL PARTIAL PARTIAL Vijeth Murali Sagar T2235
Connectivity
bluez-hfp Test Hands Free Profile (HFP) BlueZ feature. Not Integrated PARTIAL PARTIAL PARTIAL PARTIAL Vijeth Murali Sagar T3687
rfkill-toggle Test that rfkill is functional. Not Integrated PASSED PASSED PASSED PASSED Vijeth Murali Sagar
telepathy-ring Support making and receiving phone calls in Telepathy manually, with a bluetooth-paired phone. Not Integrated PASSED PASSED PASSED PASSED Vijeth Murali Sagar
telepathy-ring-automated Support making and receiving phone calls in Telepathy. Integrated N/A N/A N/A PARTIAL andrewsh [56]
Contacts
folks-ofono-backend Reading contacts from 3G modem SIM card. Not Integrated PASSED PASSED PASSED PASSED Vijeth Murali Sagar
folks-search-contacts Ensures that Folks can correctly search contacts. Integrated NOT TESTED PARTIAL PARTIAL NOT TESTED andrewsh [57] [58]
abstract-contact-addressbook-creation A way to be able to create abstract addressbook is needed in SyncEvolution, so that separate addressbooks can be created for each paired device. Integrated NOT TESTED PASSED PASSED NOT TESTED andrewsh [59] [60]
folks-sync-only Test SYNCHRONIZE_ONLY flag for persona stores in Folks. Integrated N/A N/A N/A PASSED andrewsh [61]
storage-arbitrary-data-contacts Support for storing arbitrary data in contacts in Folks. Integrated NOT TESTED PASSED PASSED NOT TESTED andrewsh [62] [63]
Multimedia
webkit-gstreamer1.0 Tests html5 video playback with GStreamer 1.0 in WebKit-Clutter Not Integrated PASSED PASSED PASSED PASSED Vijeth Murali Sagar
clutter-buffering-2.0 Test clutter-gst stream buffering support against gstreamer 1.0. Not Integrated PASSED PASSED PASSED PASSED Vijeth Murali Sagar
clutter-live-media-2.0 Test clutter-gst live media improvements support against gstreamer 1.0. Not Integrated PASSED PASSED PASSED PASSED Vijeth Murali Sagar
traffic-control-basic Test basic traffic control support. This test does not use tcmmd but it could catch missing support in the kernel or misbehaving traffic control. Not Integrated PASSED PASSED PASSED PASSED Vijeth Murali Sagar
traffic-control-tcmmd Test traffic control support with tcmmd and wget. Not Integrated PASSED PASSED PASSED PASSED Vijeth Murali Sagar
traffic-control-tcdemo Test traffic control demo with tcmmd and tcdemo. Not Integrated PASSED PASSED PASSED PASSED Vijeth Murali Sagar
gstreamer-buffering Test the download-buffering playback mode of clutter-gst-3.0. Not Integrated PASSED PASSED PASSED PASSED Vijeth Murali Sagar
gstreamer-splash Test whether the gstreamer splash plugin is working. Not Integrated PASSED N/A N/A N/A Vijeth Murali Sagar
video-animation-on-boot Test whether Plymouth is able to display a graphical theme. Not Integrated PASSED PASSED PASSED PASSED Vijeth Murali Sagar
Robustness
glib-gio-fs Run the GLib gio tests that do I/O on the local filesystem. Integrated NOT TESTED PASSED PASSED NOT TESTED andrewsh [64] [65]
sqlite-veryquick Run the "veryquick" tests shipped with SQLite. Integrated NOT TESTED NOT TESTED PARTIAL NOT TESTED andrewsh [66]
Security
apparmor Functional testing for AppArmor functionalities. Integrated PARTIAL PARTIAL PARTIAL NOT TESTED andrewsh [67] [68] [69]
apparmor-chaiwala-system Test that AppArmor's system wide rules works according to Apertis security goals. Integrated PASSED PASSED PASSED NOT TESTED andrewsh [70] [71] [72]
apparmor-functional-demo Show some main AppArmor functionalities, like transitions, net access or resource permissions, under the form of tests. Integrated PASSED PASSED PASSED NOT TESTED andrewsh [73] [74] [75]
apparmor-utils Test apparmor_parser and other tools in apparmor package can be executed. Integrated PASSED FAILED PASSED NOT TESTED andrewsh [76] [77] [78]
apparmor-session-lockdown-no-deny Test that the session lockdown profile is not blocking more than it should Integrated NOT TESTED NOT TESTED NOT TESTED NOT TESTED
apparmor-gstreamer1.0 Test that AppArmor profiles provided in GStreamer 1.0 works without Auditd complaining Integrated PARTIAL PARTIAL PARTIAL NOT TESTED andrewsh [79] [80] [81]
apparmor-pulseaudio Test that AppArmor profiles provided in PulseAudio 2.1 work without Auditd complaining. Integrated PARTIAL PASSED PASSED NOT TESTED andrewsh [82] [83] [84]
apparmor-bluez-automated Test AppArmor profile for support for SPP profile (bluez-spp) and core functionalities (bluez-core). Not Integrated PASSED PASSED PASSED N/A Vijeth Murali Sagar
apparmor-bluez-avrcp-volume Test AppArmor profile for Bluez AVRCP volume up and down commands. Not Integrated PASSED PASSED PASSED N/A Vijeth Murali Sagar
apparmor-bluez-setup Test AppArmor profiles for setting up of Bluetooth stack by running basic tests using hciconfig. Check if the interface can be brought up/down, can be changed of mode and can discover devices. Not Integrated PASSED PASSED PASSED N/A Vijeth Murali Sagar
apparmor-folks Test that AppArmor profiles provided in Folks package work without unexpected auditd log entries. Integrated PARTIAL PARTIAL PARTIAL NOT TESTED andrewsh [85] [86] [87]
apparmor-geoclue Test that geoclue apparmor profiles are working properly Integrated PASSED FAILED PASSED NOT TESTED andrewsh [88] [89] [90]
apparmor-libreoffice Tests that the libreoffice profile doesn't cause false negatives and that it does not allow arbitrary reading of files in the home directory. Integrated NOT TESTED NOT TESTED NOT TESTED NOT TESTED
apparmor-ofono Test that AppArmor profiles provided in ofono package work without unexpected auditd log entries. Not Integrated PASSED PASSED PASSED N/A Vijeth Murali Sagar
apparmor-tracker Tests that the tracker abstraction and tracker profiles don't cause false negatives and that it does not allow arbitrary reading of files in the home directory. Integrated PASSED FAILED FAILED NOT TESTED andrewsh [91] [92] [93]
apparmor-tumbler Tests that the tumbler profile doesn't cause false negatives and that it does not allow arbitrary reading of files in the home directory. Integrated PASSED PASSED PASSED NOT TESTED andrewsh [94] [95] [96]
iptables-basic Test the firewall automatically. Integrated NOT TESTED PASSED PASSED NOT TESTED andrewsh [97] [98]
iptables-nmap Test the firewall using nmap from another computer. Not Integrated PASSED PASSED PASSED PASSED Vijeth Murali Sagar
apparmor-dbus Functional testing for AppArmor D-Bus mediation. Integrated PASSED PASSED PASSED NOT TESTED andrewsh [99] [100] [101]
System Update
factory-reset-tool Check if the system can be restored to a factory reset state. Not Integrated FAILED N/A N/A N/A Vijeth Murali Sagar T2239
last-resort-message Test whether U-Boot last resort image is displayed on boot failure Not Integrated PASSED N/A N/A N/A Vijeth Murali Sagar
limited-functionality-manual Test whether the limited functionality mode can be triggered. Not Integrated FAILED N/A N/A N/A Vijeth Murali Sagar T2550
v4l-automated Test the v4l codepaths of chaiwala-v4l2fb. Integrated NOT TESTED PASSED PASSED NOT TESTED andrewsh [102] [103]
boot-performance Test boot performance. Not Integrated PASSED PASSED PASSED N/A Vijeth Murali Sagar
boot-performance-automated Test boot performance. Integrated NOT TESTED PASSED PASSED NOT TESTED andrewsh [104] [105]
Webkit
webkit-aligned-scroll Test that scrolling is pinned in a given direction when started mostly towards it. Not Integrated PASSED PASSED PASSED N/A Vijeth Murali Sagar T1964
webkit-lazy-click Test touch adjustment (lazy click) support in WebKit-Clutter Not Integrated PASSED PASSED PASSED PASSED Vijeth Murali Sagar
webkit-drag-and-drop Test HTML5 drag-and-drop support in WebKit-Clutter Not Integrated PASSED PASSED PASSED PASSED Vijeth Murali Sagar
webkit-contextual-zoom This test case is about zooming parts of a web page to make it easier to read on devices with limited screen area. The scope of the test is the zooming functionality that takes into account the content in the clicked area, other functionality that belongs to a real browser isn't to be tested here. Not Integrated PASSED PASSED PASSED PASSED Vijeth Murali Sagar
webkit-clutter-javascriptcore JavaScriptCore tests are implementation of the Mozilla JavaScript Test Suite. This test suite covers the functionality of the core JavaScript engine. This includes several JavaScript objects such as Arrays, Booleans, Dates, Functions, Global Object, Math, Numbers, Objects, Regular Expressions and Strings. In addition the JavaScript tests cover parsing, lexical conventions, expressions, statements, type conversion, and exception handling. Integrated NOT TESTED FAILED PARTIAL PARTIAL andrewsh [106] [107] [108]
PASSED - All tests passed.
PARTIAL - Tests mostly passed, with some minor problems.
FAILED - One or more tests failed.
NOT TESTED - Test not run due to some issue, like WIP, Disabled, lacking proper hardware.
Personal tools
Namespaces

Variants
Actions
Navigation
Tools