15.12/TestReports/20151008

From Apertis
Jump to: navigation, search

Testing results considerations:

  1. All manual test cases were executed on Target i386 and SDK i386 image, and were executed as needed by the development team on the Target ARM image.
  2. All automated test cases already integrated into LAVA system were executed on images: Target ARM, Target AMD64, Development AMD64, Target i386, Development i386 and SDK i386.
  3. Test cases marked as 'under development' were skipped during this testing round.
  4. Failures and partial failures were noted in the Release notes document for further analyse.



The platform image used for these tests are :

ID Description Type Target ARM Target AMD64 Development AMD64 Target x86 Devel x86 SDK x86 Tested By Notes
Booting
image-bootable Test whether the image is bootable. Not Integrated PASSED NOT TESTED NOT TESTED PASSED FAILED FAILED Piyush Boopathi Parthiban bug 545
image-x-start Test whether the image starts a graphical environment. Not Integrated PASSED NOT TESTED NOT TESTED PASSED FAILED FAILED Piyush Boopathi Parthiban bug 545
HW Acceleration
x-hw-accelerated Test whether the correct GLES2 render is used. Not Integrated PASSED N/A N/A PASSED N/A NOT TESTED Piyush Boopathi Parthiban
GStreamer
clutter-playback-gstreamer1.0 Test video and audio playback using clutter-gst and GStreamer1.0. Not Integrated PARTIAL N/A N/A PARTIAL N/A NOT TESTED Piyush Boopathi Parthiban bug 498
gstreamer1.0-decode Test video and audio decoders and demuxers on a list of media. Integrated PASSED PASSED NOT TESTED PASSED NOT TESTED NOT TESTED Araujo [1] [2] [3] (bug 545, bug 546)
Multitouch
clutter-actors-bigger-reactive-area Test that Clutter allows an actor's pick area to be larger than its paint area. Not Integrated PASSED N/A N/A PASSED N/A NOT TESTED Piyush Boopathi Parthiban
clutter-mt-rotate Test that clutter properly performs rotation gestures. Not Integrated PASSED N/A N/A PASSED N/A N/A Piyush Boopathi
clutter-mt-touch-events Test multi-touch support in Clutter. Not Integrated PASSED N/A N/A PASSED N/A N/A Piyush Boopathi
clutter-mt-zoom Test that clutter properly performs zoom gestures. Not Integrated PASSED N/A N/A PASSED N/A N/A Piyush Boopathi
clutter-transparent-stage Test that clutter transparent stages are correctly handled by the graphics stack. Not Integrated PASSED N/A N/A PASSED N/A N/A Piyush Boopathi
webkit-mt-touch-events Test implementation of W3C touch events API in webkit-clutters. Not Integrated PASSED N/A N/A PASSED N/A N/A Piyush Boopathi
xephyr-mt-touch-events Test that X clients within Xephyr receive touch events forwarded from the host X display.

This test is used for both touchscreen *and* support for the Magic Trackpad. So please, do test for both cases below:

Not Integrated N/A N/A N/A N/A N/A NOT TESTED Parthiban
WebKit
webkit-actor-tiles Test implementation of actor-based tiled backing store in webkit-clutter. Not Integrated PASSED N/A N/A PASSED N/A NOT TESTED Piyush Boopathi Parthiban
webkit-event-handling-redesign Test WebKit-Clutter ability to scroll by touch with inertial behaviour after the touch ended. Not Integrated PASSED N/A N/A PASSED N/A NOT TESTED Piyush Boopathi Parthiban
webkit-layout-tests Layout tests are used to check the correctness of the renderer. It involves loading pages in a test renderer (DumpRenderTree) and comparing the rendered output tree against an expected output file. Integrated FAILED PARTIAL NOT TESTED PARTIAL NOT TESTED NOT TESTED Araujo [4] [5] [6] (bug 545, bug 546)
Webkit-AC
webkit-ac-3d-rendering Test that 3D transforms are applied correctly. Not Integrated PASSED N/A N/A PASSED N/A NOT TESTED Piyush Boopathi Parthiban
webkit-ac-animations Test that Clutter actors created for representing layers animate properly. Not Integrated PASSED N/A N/A PASSED N/A NOT TESTED Piyush Boopathi Parthiban
webkit-ac-scrolling Test that actors created for representing layers scroll properly. Not Integrated PASSED N/A N/A PASSED N/A NOT TESTED Piyush Boopathi Parthiban
Gettext
clutter-i18n-gettext Check that internationalization (translation) of Clutter applications using gettext works. Not Integrated PASSED N/A N/A PASSED N/A NOT TESTED Piyush Boopathi Parthiban
gettext-i18n Check that gettext internationalization works. Integrated PASSED PASSED NOT TESTED PASSED NOT TESTED NOT TESTED Araujo [7] [8] [9] (bug 545, bug 546)
Meta Data Management
gupnp-services Run a few tests related to service browsing, introspection, etc. Integrated PARTIAL PARTIAL NOT TESTED PARTIAL NOT TESTED NOT TESTED Araujo [10] [11] [12] (bug 545, bug 546)
librest-unit Run the unit tests that ship with the library against the running system. Integrated PARTIAL PARTIAL NOT TESTED PARTIAL NOT TESTED NOT TESTED Araujo [13] [14] [15] (bug 545, bug 546)
libsoup-unit Run the unit tests that ship with the library against the running system. Integrated PASSED PARTIAL NOT TESTED PASSED NOT TESTED NOT TESTED Araujo [16] [17] [18] (bug 545, bug 546)
tracker-indexing-local-storage Check tracker indexing of local storage and journal behaviour. Integrated FAILED FAILED NOT TESTED FAILED NOT TESTED NOT TESTED Araujo [19] [20] [21] (bug 545, bug 546)
tracker-indexing-mass-storage Check tracker indexes mass storage devices on insertion. Not Integrated FAILED N/A N/A FAILED N/A NOT TESTED Piyush Boopathi Parthiban bug 542
tumbler-thumbnailing Check that all thumbnailing features of tumbler are working properly (large, small, videos, documents, images). Integrated PASSED PASSED NOT TESTED PASSED NOT TESTED NOT TESTED Araujo [22] [23] [24] (bug 545, bug 546)
Grilo
grilo Check grilo metadata notifications, and filesystem browsing. Integrated PARTIAL PARTIAL NOT TESTED PARTIAL NOT TESTED NOT TESTED Araujo [25] [26] [27] (bug 545, bug 546)
DBus
dbus-dos-reply-time Check the reply time of a few D-Bus method calls while dbus-daemon is loaded by D-Bus traffic. Integrated PASSED PASSED NOT TESTED PASSED NOT TESTED NOT TESTED Araujo [28] [29] [30] (bug 545, bug 546)
Networking
bluez-avrcp-volume Test the AVRCP volume up and down commands. Not Integrated PASSED N/A N/A PASSED N/A N/A Boopathi Piyush
bluez-phone Test all BlueZ features needing interaction with a phone (Pairing, OBEX, PBAP, AVRCP, A2DP, HSP, HFP, PAN). Not Integrated PASSED N/A N/A PARTIAL N/A NOT TESTED Boopathi Piyush Parthiban bug 499
bluez-setup Test setup of Bluetooth stack by running basic tests using hciconfig. Check if the interface can be brought up/down, can be changed of mode and can discover devices. Not Integrated PASSED N/A N/A PASSED N/A NOT TESTED Boopathi Piyush Parthiban
connman Runs some automated tests using the ConnMan D-Bus API. It guarantees most of the basic features are working. Integrated PASSED PASSED NOT TESTED PASSED NOT TESTED NOT TESTED Araujo [31] [32] [33] (bug 545, bug 546)
connman-new-supplicant Test the wpa_supplicant interface. Integrated PASSED PASSED NOT TESTED PASSED NOT TESTED NOT TESTED Araujo [34] [35] [36] (bug 545, bug 546)
connman-pan-tethering Test ConnMan support for PAN connectivity. Not Integrated PASSED N/A N/A PASSED N/A NOT TESTED Piyush Boopathi Parthiban
connman-services Tests ConnMan services. Not Integrated PASSED N/A N/A PASSED N/A NOT TESTED Piyush Boopathi Parthiban
connman-usb-tethering Test ConnMan support for USB tethering (connection side). Not Integrated PASSED N/A N/A PASSED N/A N/A Piyush Boopathi
ofono-sms-receive Test receiving SMS messages with oFono. Not Integrated N/A N/A N/A PASSED N/A NOT TESTED Piyush Parthiban
ofono-sms-send Test sending of SMS with oFono. Not Integrated N/A N/A N/A PASSED N/A NOT TESTED Piyush Parthiban
Folks
folks-alias-persistence Ensures user-set contact aliases persist. Integrated PASSED PASSED NOT TESTED PASSED NOT TESTED NOT TESTED Araujo [37] [38] [39] (bug 545, bug 546)
folks-eds-compatibility Checks that contacts created within Evolution Data Server (as will happen when phone contacts get synchronized to an Apertis machine) show up in other contact-based programs. Integrated PARTIAL PARTIAL NOT TESTED PARTIAL NOT TESTED NOT TESTED Araujo [40] [41] [42] (bug 545, bug 546)
folks-metacontacts-linking Ensures linking meta-contacts works properly. Integrated PARTIAL PARTIAL NOT TESTED PARTIAL NOT TESTED NOT TESTED Araujo [43] [44] [45] (bug 545, bug 546)
folks-metacontacts-unlinking Ensures unlinking meta-contacts works properly. Integrated PARTIAL PARTIAL NOT TESTED PARTIAL NOT TESTED NOT TESTED Araujo [46] [47] [48] (bug 545, bug 546)
folks-telepathy-retrieve-contacts Ensures that Folks can correctly retrieve Telepathy contacts. Integrated PASSED PASSED NOT TESTED PASSED NOT TESTED NOT TESTED Araujo [49] [50] [51] (bug 545, bug 546)
Telepathy
telepathy-gabble-unit Run telepathy-gabble test suite. Integrated PARTIAL PARTIAL NOT TESTED PARTIAL NOT TESTED NOT TESTED Araujo [52] [53] [54] (bug 545, bug 546)
telepathy-rakia Test Telepathy rakia integration Not Integrated PASSED N/A N/A PASSED N/A NOT TESTED Piyush Boopathi Parthiban
SDK Development
sdk-ide-build-run-program Creates a simple test project and confirms that compiling and executing work. Not Integrated N/A N/A N/A N/A N/A NOT TESTED Parthiban
sdk-nested-wm Tests that Devilspie scripts can be applied to windows running within Mutter. Not Integrated N/A N/A N/A N/A N/A NOT TESTED Parthiban
Apparmor Basic
apparmor-basic-profiles Test basic apparmor profiles. Only parsing and syntax of profiles are tested for now. Integrated PASSED PASSED NOT TESTED PASSED NOT TESTED NOT TESTED Araujo [55] [56] [57] (bug 545, bug 546)
CGroups
cgroups-resource-control Run cgroup resource control tests Integrated PARTIAL PARTIAL NOT TESTED PARTIAL NOT TESTED NOT TESTED Araujo [58] [59] [60] (bug 545, bug 546)
SDK
sdk-performance-tools-gprof-smoke-test Checks basic gprof functionality by ensuring a CPU-intensive program shows up in its log as consuming the vast majority of the CPU cycles. Integrated N/A N/A N/A N/A N/A NOT TESTED Araujo (bug 545)
sdk-performance-tools-sysprof-smoke-test Checks basic sysprof functionality by ensuring a CPU-intensive program shows up in its log as consuming the vast majority of the CPU cycles. Integrated N/A N/A N/A N/A N/A NOT TESTED Araujo (bug 545)
sdk-debug-tools-gdb-smoke-test Checks basic gdb functionality by stopping a program at a set point and checking its backtrace matches expectations. Integrated N/A N/A N/A N/A N/A NOT TESTED Araujo (bug 545)
sdk-debug-tools-strace-smoke-test Checks basic strace functionality by checking its output when run on a simple command line program. Integrated N/A N/A N/A N/A N/A NOT TESTED Araujo (bug 545)
sdk-debug-tools-valgrind-smoke-test Checks basic valgrind functionality by running a program with and without memory leaks, ensuring expected results from valgrind. Integrated N/A N/A N/A N/A N/A NOT TESTED Araujo (bug 545)
sdk-dbus-tools-bustle-smoke-test Test that bustle-dbus-monitor shows services on the session bus. Not Integrated N/A N/A N/A N/A N/A NOT TESTED Parthiban
sdk-dbus-tools-d-feet-smoke-test Test that D-Feet both shows services on the session bus and that new services appear automatically. Not Integrated N/A N/A N/A N/A N/A NOT TESTED Parthiban
sdk-code-analysis-tools-gcov-smoke-test Checks basic gcov functionality by running a sample program a few different ways and ensuring that a sufficient portion of its code paths are executed Integrated N/A N/A N/A N/A N/A NOT TESTED Araujo (bug 545)
sdk-code-analysis-tools-splint-smoke-test Checks basic splint functionality by checking its output when run on a simple source file. Integrated N/A N/A N/A N/A N/A NOT TESTED Araujo (bug 545)
sdk-vb-fullscreen Tests that the SDK VM can be fullscreened in VirtualBox Not Integrated N/A N/A N/A N/A N/A NOT TESTED Parthiban
Eclipse
eclipse-sysroot-management Test sysroot management and update within Eclipse. It will go through configuring an existing sysroot in Eclipse, and then updating it from the web with the latest version. Not Integrated N/A N/A N/A N/A N/A NOT TESTED Parthiban
eclipse-install-to-target Test copying files to the remote device from within Eclipse. It will create a dummy project and then create a configuration to copy the binary file to a remote device and debug it remotely using Eclipse. Not Integrated N/A N/A N/A N/A N/A NOT TESTED Parthiban
eclipse-remote-debugging Test remote debugging within Eclipse. It will create a dummy project and then create a configuration to copy the binary file to a remote device and debug it remotely using Eclipse. Not Integrated N/A N/A N/A N/A N/A NOT TESTED Parthiban
Contacts
evolution-sync-bluetooth Synchronizing Bluetooth-paired phone contacts to Evolution. Not Integrated PASSED N/A N/A PASSED N/A NOT TESTED Boopathi Piyush Parthiban
folks-metacontacts-antilinking Ensures anti-linking meta-contacts works properly. Integrated PASSED PASSED NOT TESTED PASSED NOT TESTED NOT TESTED Araujo [61] [62] [63] (bug 545, bug 546)
Clutter Multitouch
xoo-soft-keys-emulation Test that 'xoo' allows one to pass-in Xephyr-nested key events from clicking UI buttons Integrated N/A N/A N/A N/A N/A NOT TESTED Araujo (bug 545)
clutter-performance Test performance of Clutter Integrated NOT TESTED FAILED NOT TESTED PARTIAL NOT TESTED NOT TESTED Araujo [64] [65] (bug 390, bug 545, bug 546)
x-out-of-screen-events-buttond Test that buttond generates correct keystrokes in response to simulated touch screen input Integrated PARTIAL PASSED NOT TESTED PASSED NOT TESTED NOT TESTED Araujo [66] [67] [68] (bug 545, bug 546)
mxkineticscrollview-smooth-pan Some low-resolution touch screens send touch events in widely separate time intervals, which causes MxKineticScrollView widget to jump from one position to the next one without any visible transition. This test case implements a long list to scroll through to make sure there are no visible "jumps" when scrolling. Not Integrated FAILED N/A N/A PARTIAL N/A NOT TESTED Piyush Parthiban bug 543
Connectivity
bluez-hfp Test Hands Free Profile (HFP) BlueZ feature. Not Integrated N/A N/A N/A PASSED N/A N/A Piyush
rfkill-toggle Test that rfkill is functional. Not Integrated PASSED N/A N/A PASSED N/A N/A Boopathi
telepathy-ring Support making and receiving phone calls in Telepathy manually, with a bluetooth-paired phone. Not Integrated PARTIAL N/A N/A PARTIAL N/A NOT TESTED Boopathi Piyush Parthiban bug 156
telepathy-ring-automated Support making and receiving phone calls in Telepathy. Integrated N/A N/A N/A N/A N/A NOT TESTED Araujo (bug 545)
Contacts
folks-ofono-backend Reading contacts from 3G modem SIM card. Not Integrated N/A N/A N/A PASSED N/A NOT TESTED Piyush Parthiban
folks-search-contacts Ensures that Folks can correctly search contacts. Integrated PASSED PASSED NOT TESTED PASSED NOT TESTED NOT TESTED Araujo [69] [70] [71] (bug 545, bug 546)
abstract-contact-addressbook-creation A way to be able to create abstract addressbook is needed in SyncEvolution, so that separate addressbooks can be created for each paired device. Integrated PASSED PASSED NOT TESTED PASSED NOT TESTED NOT TESTED Araujo [72] [73] [74] (bug 545, bug 546)
folks-sync-only Test SYNCHRONIZE_ONLY flag for persona stores in Folks. Integrated N/A N/A N/A N/A N/A NOT TESTED Araujo (bug 545)
storage-arbitrary-data-contacts Support for storing arbitrary data in contacts in Folks. Integrated PARTIAL PARTIAL NOT TESTED PARTIAL NOT TESTED NOT TESTED Araujo [75] [76] [77] (bug 545, bug 546)
Meta Data Management
grilo-playlist-browsing Test playlist browsing from grilo, that is basically Grilo can inspect playlist contents and show its entries as if they were Grilo Media objects. Integrated PASSED PASSED NOT TESTED PASSED NOT TESTED NOT TESTED Araujo [78] [79] [80] (bug 545, bug 546)
Multimedia
webkit-gstreamer1.0 Tests html5 video playback with GStreamer 1.0 in WebKit-Clutter Not Integrated PASSED N/A N/A PASSED N/A NOT TESTED Piyush Boopathi Parthiban
clutter-buffering-2.0 Test clutter-gst stream buffering support against gstreamer 1.0. Not Integrated PASSED N/A N/A PASSED N/A NOT TESTED Piyush Boopathi Parthiban
clutter-live-media-2.0 Test clutter-gst live media improvements support against gstreamer 1.0. Not Integrated PASSED N/A N/A PASSED N/A NOT TESTED Piyush Boopathi Parthiban
traffic-control-basic Test basic traffic control support. This test does not use tcmmd but it could catch missing support in the kernel or misbehaving traffic control. Not Integrated PASSED N/A N/A PASSED N/A NOT TESTED Piyush Boopathi Parthiban
traffic-control-tcmmd Test traffic control support with tcmmd and wget. Not Integrated PASSED N/A N/A FAILED N/A NOT TESTED Boopathi Piyush Parthiban bug 327
traffic-control-tcdemo Test traffic control demo with tcmmd and tcdemo. Not Integrated FAILED N/A N/A PASSED N/A N/A Boopathi Piyush Parthiban bug 548
gstreamer-buffering Test the download-buffering playback mode of clutter-gst-3.0. Not Integrated PARTIAL N/A N/A PARTIAL N/A NOT TESTED Piyush Boopathi Parthiban bug 498
gstreamer-splash Test whether the gstreamer splash plugin is working. Not Integrated NOT TESTED N/A N/A N/A N/A N/A camera not available
video-animation-on-boot Test whether Plymouth is able to display a graphical theme. Not Integrated PASSED N/A N/A PASSED N/A N/A Piyush Boopathi
gstreamer-viv-direct-texture Test the GStreamer integration of the Vivante direct texture extension, which enables fast video playback on i.MX6. Not Integrated PARTIAL N/A N/A N/A N/A N/A Boopathi
Robustness
glib-gio-fs Run the GLib gio tests that do I/O on the local filesystem. Integrated PASSED PASSED NOT TESTED PASSED NOT TESTED NOT TESTED Araujo [81] [82] [83] (bug 545, bug 546)
sqlite-veryquick Run the "veryquick" tests shipped with SQLite. Integrated PASSED PARTIAL NOT TESTED PASSED NOT TESTED NOT TESTED Araujo [84] [85] [86] (bug 545, bug 546)
Security
apparmor Functional testing for AppArmor functionalities. Integrated PARTIAL PARTIAL NOT TESTED PARTIAL NOT TESTED NOT TESTED Araujo [87] [88] [89] (bug 545, bug 546)
apparmor-chaiwala-system Test that AppArmor's system wide rules works according to Apertis security goals. Integrated PASSED PASSED NOT TESTED PASSED NOT TESTED NOT TESTED Araujo [90] [91] [92] (bug 545, bug 546)
apparmor-functional-demo Show some main AppArmor functionalities, like transitions, net access or resource permissions, under the form of tests. Integrated PASSED PASSED NOT TESTED PASSED NOT TESTED NOT TESTED Araujo [93] [94] [95] (bug 545, bug 546)
apparmor-utils Test apparmor_parser and other tools in apparmor package can be executed. Integrated PASSED PASSED NOT TESTED PASSED NOT TESTED NOT TESTED Araujo [96] [97] [98] (bug 545, bug 546)
apparmor-session-lockdown-denies Test that the MxLauncher profile is indeed limited to what is allows. Not Integrated PASSED N/A N/A PASSED N/A N/A Boopathi Piyush
apparmor-session-lockdown-launcher-whitelist Make sure our demo/test launcher is applying the white-list approach properly. Not Integrated PASSED N/A N/A PASSED N/A N/A Boopathi Piyush
apparmor-session-lockdown-no-deny Test that the session lockdown profile is not blocking more than it should Not Integrated FAILED N/A N/A PASSED N/A N/A Piyush Boopathi bug 549
apparmor-gstreamer1.0 Test that AppArmor profiles provided in GStreamer 1.0 works without Auditd complaining Integrated PASSED PASSED NOT TESTED PASSED NOT TESTED NOT TESTED Araujo [99] [100] [101]
apparmor-pulseaudio Test that AppArmor profiles provided in PulseAudio 2.1 work without Auditd complaining. Integrated PARTIAL PASSED NOT TESTED PASSED NOT TESTED NOT TESTED Araujo [102] [103] [104] (bug 545, bug 546)
apparmor-webkit-clutter Tests that the webkit-clutter abstraction doesn't cause false negatives and that it does not allow arbitrary reading of files in the home directory. Integrated PASSED PASSED NOT TESTED PARTIAL NOT TESTED NOT TESTED Araujo [105] [106] [107] (bug 545, bug 546)
apparmor-bluez-automated Test AppArmor profile for support for SPP profile (bluez-spp) and core functionalities (bluez-core). Not Integrated N/A N/A N/A PARTIAL N/A N/A Piyush bug 510
apparmor-bluez-avrcp-volume Test AppArmor profile for Bluez AVRCP volume up and down commands. Not Integrated FAILED N/A N/A FAILED N/A N/A Piyush Boopathi bug 512
apparmor-bluez-setup Test AppArmor profiles for setting up of Bluetooth stack by running basic tests using hciconfig. Check if the interface can be brought up/down, can be changed of mode and can discover devices. Not Integrated N/A N/A N/A FAILED N/A N/A Piyush bug 511
apparmor-folks Test that AppArmor profiles provided in Folks package work without unexpected auditd log entries. Integrated PARTIAL PARTIAL NOT TESTED PARTIAL NOT TESTED NOT TESTED Araujo [108] [109] [110] (bug 545, bug 546)
apparmor-geoclue Test that geoclue apparmor profiles are working properly Integrated PASSED PASSED NOT TESTED PASSED NOT TESTED NOT TESTED Araujo [111] [112] [113] (bug 545, bug 546)
apparmor-libreoffice Tests that the libreoffice profile doesn't cause false negatives and that it does not allow arbitrary reading of files in the home directory. Integrated FAILED PARTIAL NOT TESTED FAILED NOT TESTED NOT TESTED Araujo [114] [115] [116] (bug 545, bug 546)
apparmor-ofono Test that AppArmor profiles provided in ofono package work without unexpected auditd log entries. Not Integrated N/A N/A N/A PASSED N/A N/A Piyush
apparmor-tracker Tests that the tracker abstraction and tracker profiles don't cause false negatives and that it does not allow arbitrary reading of files in the home directory. Integrated FAILED FAILED NOT TESTED FAILED NOT TESTED NOT TESTED Araujo [117] [118] [119] (bug 545, bug 546)
apparmor-tumbler Tests that the tumbler profile doesn't cause false negatives and that it does not allow arbitrary reading of files in the home directory. Integrated PASSED PASSED NOT TESTED PASSED NOT TESTED NOT TESTED Araujo [120] [121] [122] (bug 545, bug 546)
iptables-basic Test the firewall automatically. Integrated PASSED PASSED NOT TESTED PASSED NOT TESTED NOT TESTED Araujo [123] [124] [125] (bug 545, bug 546)
iptables-nmap Test the firewall using nmap from another computer. Not Integrated PASSED N/A N/A PASSED N/A NOT TESTED Piyush Boopathi Parthiban
apparmor-dbus Functional testing for AppArmor D-Bus mediation. Integrated PASSED PASSED NOT TESTED PASSED NOT TESTED NOT TESTED Araujo [126] [127] [128] (bug 545, bug 546)
System Update
updater-update-platform Test that chaiwala-updater is capable of performing a full platform update. Not Integrated FAILED N/A N/A N/A N/A N/A Boopathi bug 547
btrfs-snapshot-management Test subvolume management using Btrfs for system upgrades. Integrated PASSED PASSED NOT TESTED PASSED NOT TESTED NOT TESTED Araujo [129] [130] [131] (bug 545, bug 546)
factory-reset-tool Check if the system can be restored to a factory reset state. Not Integrated FAILED N/A N/A N/A N/A N/A Boopathi bug 386
last-resort-message Test whether U-Boot last resort image is displayed on boot failure Not Integrated PASSED N/A N/A N/A N/A N/A Boopathi
limited-functionality-manual Test whether the limited functionality mode can be triggered. Not Integrated NOT TESTED N/A N/A N/A N/A N/A Camera not available
v4l-automated Test the v4l codepaths of chaiwala-v4l2fb. Integrated PASSED PARTIAL NOT TESTED PARTIAL NOT TESTED NOT TESTED Araujo [132] [133] [134] (bug 545, bug 546)
boot-performance Test boot performance. Not Integrated FAILED N/A N/A N/A N/A N/A Boopathi bug 467
boot-performance-automated Test boot performance. Integrated PASSED PASSED NOT TESTED PASSED NOT TESTED NOT TESTED Araujo [135] [136] [137] (bug 545, bug 546)
Webkit
webkit-aligned-scroll Test that scrolling is pinned in a given direction when started mostly towards it. Not Integrated PASSED N/A N/A PASSED N/A N/A Piyush Boopathi
webkit-lazy-click Test touch adjustment (lazy click) support in WebKit-Clutter Not Integrated PASSED N/A N/A PASSED N/A NOT TESTED Piyush Boopathi Parthiban
webkit-drag-and-drop Test HTML5 drag-and-drop support in WebKit-Clutter Not Integrated PASSED N/A N/A PASSED N/A NOT TESTED Piyush Boopathi Parthiban
webkit-contextual-zoom This test case is about zooming parts of a web page to make it easier to read on devices with limited screen area. The scope of the test is the zooming functionality that takes into account the content in the clicked area, other functionality that belongs to a real browser isn't to be tested here. Not Integrated PASSED N/A N/A PASSED N/A NOT TESTED Piyush Boopathi Parthiban
webkit-clutter-javascriptcore JavaScriptCore tests are implementation of the Mozilla JavaScript Test Suite. This test suite covers the functionality of the core JavaScript engine. This includes several JavaScript objects such as Arrays, Booleans, Dates, Functions, Global Object, Math, Numbers, Objects, Regular Expressions and Strings. In addition the JavaScript tests cover parsing, lexical conventions, expressions, statements, type conversion, and exception handling. Integrated FAILED PARTIAL NOT TESTED PARTIAL NOT TESTED NOT TESTED Araujo [138] [139] [140] (bug 545, bug 546)
PASSED - All tests passed.
PARTIAL - Tests mostly passed, with some minor problems.
FAILED - One or more tests failed.
NOT TESTED - Test not run due to some issue, like WIP, Disabled, lacking proper hardware.
Personal tools
Namespaces

Variants
Actions
Navigation
Tools