15.09/TestReports/20150730

From Apertis
Jump to: navigation, search

Testing results considerations:

  1. All manual test cases were executed on Target x86 and SDK x86 image, and were executed as needed by the development team on the Target ARM image.
  2. All automated test cases already integrated into LAVA system were executed on images: Target ARM, Target AMD64, Development AMD64, Target x86, Development x86 and SDK x86.
  3. Test cases marked as 'under development' were skipped during this testing round.
  4. Failures and partial failures were noted in the Release notes document for further analyse.



The platform image used for these tests are :

ID Description Type Target ARM Target AMD64 Development AMD64 Target x86 Devel x86 SDK x86 Tested By Notes
Booting
image-bootable Test whether the image is bootable. Not Integrated PASSED NOT TESTED NOT TESTED PASSED PASSED PASSED Boopathi Piyush Parthiban
image-x-start Test whether the image starts a graphical environment. Not Integrated PASSED NOT TESTED NOT TESTED PASSED PASSED PASSED Boopathi Piyush Parthiban
HW Acceleration
x-hw-accelerated Test whether the correct GLES2 render is used. Not Integrated PASSED N/A N/A PASSED N/A PASSED Boopathi Piyush Parthiban
GStreamer
clutter-playback-gstreamer1.0 Test video and audio playback using clutter-gst and GStreamer1.0. Not Integrated PASSED N/A N/A PASSED N/A FAILED Piyush Boopathi Parthiban bug 355
gstreamer1.0-decode Test video and audio decoders and demuxers on a list of media. Integrated PASSED PASSED PASSED PASSED PASSED PASSED Araujo [1] [2] [3] [4] [5] [6]
Multitouch
clutter-actors-bigger-reactive-area Test that Clutter allows an actor's pick area to be larger than its paint area. Not Integrated PASSED N/A N/A PASSED N/A FAILED Boopathi Piyush Parthiban bug 355
clutter-mt-rotate Test that clutter properly performs rotation gestures. Not Integrated PASSED N/A N/A PASSED N/A N/A Boopathi Piyush
clutter-mt-touch-events Test multi-touch support in Clutter. Not Integrated PASSED N/A N/A PASSED N/A N/A Boopathi Piyush
clutter-mt-zoom Test that clutter properly performs zoom gestures. Not Integrated PASSED N/A N/A PASSED N/A N/A Boopathi Piyush
clutter-transparent-stage Test that clutter transparent stages are correctly handled by the graphics stack. Not Integrated PASSED N/A N/A PASSED N/A N/A Boopathi Piyush
mutter-mt-touch-events Allow Mutter plugins to recognize multi-touch gestures.

This test is used for both touchscreen *and* the Magic Trackpad. So please, do test for both cases below:

Not Integrated FAILED N/A N/A FAILED N/A N/A Piyush Boopathi bug 387
webkit-mt-touch-events Test implementation of W3C touch events API in webkit-clutters. Not Integrated FAILED N/A N/A FAILED N/A N/A Piyush Booapthi bug 349
xephyr-mt-touch-events Test that X clients within Xephyr receive touch events forwarded from the host X display.

This test is used for both touchscreen *and* support for the Magic Trackpad. So please, do test for both cases below:

Not Integrated N/A N/A N/A N/A N/A FAILED Parthiban bug 356
WebKit
webkit-actor-tiles Test implementation of actor-based tiled backing store in webkit-clutter. Not Integrated FAILED N/A N/A FAILED N/A FAILED Parthiban Piyush Boopathi bug 349
webkit-event-handling-redesign Test WebKit-Clutter ability to scroll by touch with inertial behaviour after the touch ended. Not Integrated FAILED N/A N/A FAILED N/A FAILED Parthiban Piyush Boopathi bug 349
webkit-layout-tests Layout tests are used to check the correctness of the renderer. It involves loading pages in a test renderer (DumpRenderTree) and comparing the rendered output tree against an expected output file. Integrated PARTIAL PARTIAL PARTIAL PARTIAL PARTIAL PARTIAL Araujo [7] [8] [9] [10] [11] [12]
Webkit-AC
webkit-ac-3d-rendering Test that 3D transforms are applied correctly. Not Integrated FAILED N/A N/A FAILED N/A FAILED Parthiban Piyush Boopathi bug 349
webkit-ac-animations Test that Clutter actors created for representing layers animate properly. Not Integrated FAILED N/A N/A FAILED N/A FAILED Parthiban Piyush Boopathi bug 349
webkit-ac-scrolling Test that actors created for representing layers scroll properly. Not Integrated FAILED N/A N/A FAILED N/A FAILED Parthiban Piyush Boopathi bug 349
Gettext
clutter-i18n-gettext Check that internationalization (translation) of Clutter applications using gettext works. Not Integrated PASSED N/A N/A PASSED N/A FAILED Parthiban Piyush Boopathi bug 355
gettext-i18n Check that gettext internationalization works. Integrated PASSED PASSED NOT TESTED PASSED PASSED PASSED Araujo [13] [14] [15] [16] [17]
Meta Data Management
gupnp-services Run a few tests related to service browsing, introspection, etc. Integrated PASSED PASSED PASSED PASSED PASSED PASSED Araujo [18] [19] [20] [21] [22] [23]
librest-unit Run the unit tests that ship with the library against the running system. Integrated PASSED PASSED PASSED PASSED PASSED PASSED Araujo [24] [25] [26] [27] [28] [29]
libsoup-unit Run the unit tests that ship with the library against the running system. Integrated PASSED PASSED NOT TESTED PASSED PASSED PASSED Araujo [30] [31] [32] [33] [34]
tracker-configuration Check if tracker indexing is configured properly. Integrated PASSED PASSED NOT TESTED PASSED PASSED PASSED Araujo [35] [36] [37] [38] [39]
tracker-indexing-local-storage Check tracker indexing of local storage and journal behaviour. Integrated PASSED PARTIAL FAILED PASSED PASSED PARTIAL Araujo [40] [41] [42] [43] [44] [45]
tracker-indexing-mass-storage Check tracker indexes mass storage devices on insertion. Not Integrated PASSED N/A N/A PASSED N/A PASSED Piyush Boopathi Parthiban
tumbler-thumbnailing Check that all thumbnailing features of tumbler are working properly (large, small, videos, documents, images). Integrated PASSED PASSED FAILED PASSED PASSED PARTIAL Araujo [46] [47] [48] [49] [50] [51]
Grilo
grilo Check grilo metadata notifications, and filesystem browsing. Integrated PASSED PASSED PASSED PASSED PASSED PASSED Araujo [52] [53] [54] [55] [56] [57]
Networking
bluez-avrcp-volume Test the AVRCP volume up and down commands. Not Integrated PASSED N/A N/A PASSED N/A N/A Piyush Boopathi
bluez-phone Test all BlueZ features needing interaction with a phone (Pairing, OBEX, PBAP, AVRCP, A2DP, HSP, HFP, PAN). Not Integrated FAILED N/A N/A FAILED N/A FAILED Piyush Parthiban Boopathi bug 350
bluez-setup Test setup of Bluetooth stack by running basic tests using hciconfig. Check if the interface can be brought up/down, can be changed of mode and can discover devices. Not Integrated PASSED N/A N/A PASSED N/A PASSED Parthiban Boopathi Piyush
connman Runs some automated tests using the ConnMan D-Bus API. It guarantees most of the basic features are working. Integrated PASSED PASSED PASSED PASSED PASSED PASSED Araujo [58] [59] [60] [61] [62] [63]
connman-new-supplicant Test the wpa_supplicant interface. Integrated PASSED PASSED PASSED PASSED PASSED PASSED Araujo [64] [65] [66] [67] [68] [69]
connman-pan-tethering Test ConnMan support for PAN connectivity. Not Integrated PASSED N/A N/A PASSED N/A PASSED Parthiban Piyush Boopathi
connman-services Tests ConnMan services. Not Integrated FAILED N/A N/A FAILED N/A FAILED Piyush Parthiban Boopathi bug 350
connman-usb-tethering Test ConnMan support for USB tethering (connection side). Not Integrated FAILED N/A N/A FAILED N/A N/A Piyush Boopathi bug 350
ofono-sms-receive Test receiving SMS messages with oFono. Not Integrated N/A N/A N/A PASSED N/A PASSED Piyush Parthiban
ofono-sms-send Test sending of SMS with oFono. Not Integrated N/A N/A N/A PASSED N/A PASSED Piyush Parthiban
Folks
folks-alias-persistence Ensures user-set contact aliases persist. Integrated PARTIAL FAILED PARTIAL PARTIAL PARTIAL PARTIAL Araujo [70] [71] [72] [73] [74] [75] (bug 366)
folks-eds-compatibility Checks that contacts created within Evolution Data Server (as will happen when phone contacts get synchronized to an Apertis machine) show up in other contact-based programs. Integrated PASSED PASSED PASSED PASSED PASSED PASSED Araujo [76] [77] [78] [79] [80] [81]
folks-metacontacts-linking Ensures linking meta-contacts works properly. Integrated PARTIAL FAILED PARTIAL PARTIAL PARTIAL PARTIAL Araujo [82] [83] [84] [85] [86] [87] (bug 366)
folks-metacontacts-unlinking Ensures unlinking meta-contacts works properly. Integrated PARTIAL FAILED PARTIAL PARTIAL PARTIAL PARTIAL Araujo [88] [89] [90] [91] [92] [93] (bug 366)
folks-telepathy-retrieve-contacts Ensures that Folks can correctly retrieve Telepathy contacts. Integrated PARTIAL FAILED PARTIAL PARTIAL PARTIAL PARTIAL Araujo [94] [95] [96] [97] [98] [99] (bug 366)
Telepathy
telepathy-gabble-unit Run telepathy-gabble test suite. Integrated PARTIAL PARTIAL NOT TESTED PARTIAL PARTIAL PARTIAL Araujo [100] [101] [102] [103] [104]
telepathy-rakia Test Telepathy rakia integration Not Integrated PASSED N/A N/A PASSED N/A PASSED Parthiban Boopathi Piyush
SDK Development
sdk-ide-build-run-program Creates a simple test project and confirms that compiling and executing work. Not Integrated N/A N/A N/A N/A N/A PASSED Parthiban
sdk-nested-wm Tests that Devilspie scripts can be applied to windows running within Mutter. Not Integrated N/A N/A N/A N/A N/A PASSED Parthiban
Apparmor Basic
apparmor-basic-profiles Test basic apparmor profiles. Only parsing and syntax of profiles are tested for now. Integrated PASSED PASSED PASSED PASSED PASSED PASSED Araujo [105] [106] [107] [108] [109] [110]
CGroups
cgroups-resource-control Run cgroup resource control tests Integrated PASSED PARTIAL NOT TESTED PARTIAL PARTIAL PARTIAL Araujo [111] [112] [113] [114] [115]
SDK
sdk-performance-tools-gprof-smoke-test Checks basic gprof functionality by ensuring a CPU-intensive program shows up in its log as consuming the vast majority of the CPU cycles. Integrated N/A N/A N/A N/A N/A PASSED Araujo [116]
sdk-performance-tools-sysprof-smoke-test Checks basic sysprof functionality by ensuring a CPU-intensive program shows up in its log as consuming the vast majority of the CPU cycles. Integrated N/A N/A N/A N/A N/A PASSED Araujo [117]
sdk-debug-tools-gdb-smoke-test Checks basic gdb functionality by stopping a program at a set point and checking its backtrace matches expectations. Integrated N/A N/A N/A N/A N/A PASSED Araujo [118]
sdk-debug-tools-strace-smoke-test Checks basic strace functionality by checking its output when run on a simple command line program. Integrated N/A N/A N/A N/A N/A PASSED Araujo [119]
sdk-debug-tools-valgrind-smoke-test Checks basic valgrind functionality by running a program with and without memory leaks, ensuring expected results from valgrind. Integrated N/A N/A N/A N/A N/A PASSED Araujo [120]
sdk-dbus-tools-bustle-smoke-test Test that bustle-dbus-monitor shows services on the session bus. Not Integrated N/A N/A N/A N/A N/A PASSED Parthiban
sdk-dbus-tools-d-feet-smoke-test Test that D-Feet both shows services on the session bus and that new services appear automatically. Not Integrated N/A N/A N/A N/A N/A PASSED Parthiban
sdk-code-analysis-tools-gcov-smoke-test Checks basic gcov functionality by running a sample program a few different ways and ensuring that a sufficient portion of its code paths are executed Integrated N/A N/A N/A N/A N/A PASSED Araujo [121]
sdk-code-analysis-tools-splint-smoke-test Checks basic splint functionality by checking its output when run on a simple source file. Integrated N/A N/A N/A N/A N/A PASSED Araujo [122]
sdk-vb-fullscreen Tests that the SDK VM can be fullscreened in VirtualBox Not Integrated N/A N/A N/A N/A N/A FAILED Parthiban bug 355
Eclipse
eclipse-sysroot-management Test sysroot management and update within Eclipse. It will go through configuring an existing sysroot in Eclipse, and then updating it from the web with the latest version. Not Integrated N/A N/A N/A N/A N/A PASSED Parthiban
eclipse-install-to-target Test copying files to the remote device from within Eclipse. It will create a dummy project and then create a configuration to copy the binary file to a remote device and debug it remotely using Eclipse. Not Integrated N/A N/A N/A N/A N/A PASSED Parthiban
eclipse-remote-debugging Test remote debugging within Eclipse. It will create a dummy project and then create a configuration to copy the binary file to a remote device and debug it remotely using Eclipse. Not Integrated N/A N/A N/A N/A N/A PASSED Parthiban
Contacts
evolution-sync-bluetooth Synchronizing Bluetooth-paired phone contacts to Evolution. Not Integrated PASSED N/A N/A PASSED N/A PASSED Parthiban Piyush Boopathi
folks-metacontacts-antilinking Ensures anti-linking meta-contacts works properly. Integrated PARTIAL FAILED PARTIAL PARTIAL PARTIAL PARTIAL Araujo [123] [124] [125] [126] [127] [128] (bug 366)
Clutter Multitouch
xoo-soft-keys-emulation Test that 'xoo' allows one to pass-in Xephyr-nested key events from clicking UI buttons Integrated N/A N/A N/A N/A N/A PARTIAL Araujo [129]
clutter-performance Test performance of Clutter Integrated FAILED FAILED FAILED PARTIAL PARTIAL PARTIAL Araujo [130] [131] [132] [133] [134] [135]
x-out-of-screen-events-buttond Test that buttond generates correct keystrokes in response to simulated touch screen input Integrated PASSED PASSED FAILED PASSED PASSED PASSED Araujo [136] [137] [138] [139] [140] [141]
mxkineticscrollview-smooth-pan Some low-resolution touch screens send touch events in widely separate time intervals, which causes MxKineticScrollView widget to jump from one position to the next one without any visible transition. This test case implements a long list to scroll through to make sure there are no visible "jumps" when scrolling. Not Integrated PARTIAL N/A N/A PARTIAL N/A PARTIAL Parthiban Boopathi Piyush bug 388
Connectivity
bluez-hfp Test Hands Free Profile (HFP) BlueZ feature. Not Integrated N/A N/A N/A PASSED N/A N/A Piyush
rfkill-toggle Test that rfkill is functional. Not Integrated PASSED N/A N/A PASSED N/A N/A Boopathi Piyush
telepathy-ring Support making and receiving phone calls in Telepathy manually, with a bluetooth-paired phone. Not Integrated PARTIAL N/A N/A PARTIAL N/A PARTIAL Parthiban Piyush Boopathi bug 156
telepathy-ring-automated Support making and receiving phone calls in Telepathy. Integrated N/A N/A N/A N/A N/A PASSED Araujo [142]
Contacts
folks-ofono-backend Reading contacts from 3G modem SIM card. Not Integrated N/A N/A N/A PASSED N/A PASSED Piyush Parthiban
folks-search-contacts Ensures that Folks can correctly search contacts. Integrated PARTIAL FAILED PARTIAL PARTIAL PARTIAL PARTIAL Araujo [143] [144] [145] [146] [147] [148] (bug 366)
abstract-contact-addressbook-creation A way to be able to create abstract addressbook is needed in SyncEvolution, so that separate addressbooks can be created for each paired device. Integrated PASSED PARTIAL PASSED PASSED PASSED PASSED Araujo [149] [150] [151] [152] [153] [154]
folks-sync-only Test SYNCHRONIZE_ONLY flag for persona stores in Folks. Integrated N/A N/A N/A N/A N/A PASSED Araujo [155]
storage-arbitrary-data-contacts Support for storing arbitrary data in contacts in Folks. Integrated PASSED PASSED PASSED PARTIAL PASSED PASSED Araujo [156] [157] [158] [159] [160] [161]
Meta Data Management
grilo-playlist-browsing Test playlist browsing from grilo, that is basically Grilo can inspect playlist contents and show its entries as if they were Grilo Media objects. Integrated PASSED PASSED PASSED PASSED PASSED PASSED Araujo [162] [163] [164] [165] [166] [167]
Multimedia
webkit-gstreamer1.0 Tests html5 video playback with GStreamer 1.0 in WebKit-Clutter Not Integrated FAILED N/A N/A FAILED N/A FAILED Parthiban Piyush Boopathi bug 349
clutter-buffering-2.0 Test clutter-gst stream buffering support against gstreamer 1.0. Not Integrated PASSED N/A N/A PASSED N/A FAILED Parthiban Boopathi Piyush bug 355
clutter-live-media-2.0 Test clutter-gst live media improvements support against gstreamer 1.0. Not Integrated PASSED N/A N/A PASSED N/A FAILED Parthiban Booapthi Piyush bug 355
traffic-control-basic Test basic traffic control support. This test does not use tcmmd but it could catch missing support in the kernel or misbehaving traffic control. Not Integrated PASSED N/A N/A PASSED N/A PASSED Parthiban Piyush Boopathi
traffic-control-tcmmd Test traffic control support with tcmmd and wget. Not Integrated FAILED N/A N/A FAILED N/A FAILED Parthiban Piyush Boopathi bug 327
traffic-control-tcdemo Test traffic control demo with tcmmd and tcdemo. Not Integrated FAILED N/A N/A FAILED N/A N/A Piyush Boopathi bug 328
gstreamer-buffering Test the download-buffering playback mode of clutter-gst-3.0. Not Integrated PASSED N/A N/A PASSED N/A FAILED Parthiban Boopathi Piyush bug 359
gstreamer-splash Test whether the gstreamer splash plugin is working. Not Integrated NOT TESTED N/A N/A N/A N/A N/A Camera not available
video-animation-on-boot Test whether Plymouth is able to display a graphical theme. Not Integrated PASSED N/A N/A PASSED N/A N/A Boopathi Piyush
gstreamer-viv-direct-texture Test the GStreamer integration of the Vivante direct texture extension, which enables fast video playback on i.MX6. Not Integrated PASSED N/A N/A N/A N/A N/A Boopathi
Robustness
glib-gio-fs Run the GLib gio tests that do I/O on the local filesystem. Integrated PASSED PASSED NOT TESTED PASSED PASSED PASSED Araujo [168] [169] [170] [171] [172]
sqlite-veryquick Run the "veryquick" tests shipped with SQLite. Integrated NOT TESTED NOT TESTED PARTIAL PASSED PASSED PASSED Araujo [173] [174] [175] [176]
Security
apparmor Functional testing for AppArmor functionalities. Integrated PARTIAL PARTIAL PARTIAL PARTIAL PARTIAL PARTIAL Araujo [177] [178] [179] [180] [181] [182]
apparmor-chaiwala-system Test that AppArmor's system wide rules works according to Apertis security goals. Integrated PASSED PASSED PASSED PASSED PASSED PASSED Araujo [183] [184] [185] [186] [187] [188]
apparmor-functional-demo Show some main AppArmor functionalities, like transitions, net access or resource permissions, under the form of tests. Integrated PASSED PASSED PASSED PASSED PASSED PASSED Araujo [189] [190] [191] [192] [193] [194]
apparmor-utils Test apparmor_parser and other tools in apparmor package can be executed. Integrated PASSED PASSED PASSED PASSED PASSED PASSED Araujo [195] [196] [197] [198] [199] [200]
apparmor-session-lockdown-denies Test that the MxLauncher profile is indeed limited to what is allows. Not Integrated PASSED N/A N/A FAILED N/A N/A Boopathi Piyush bug 347
apparmor-session-lockdown-launcher-whitelist Make sure our demo/test launcher is applying the white-list approach properly. Not Integrated PASSED N/A N/A FAILED N/A N/A Boopathi Piyush bug 347
apparmor-session-lockdown-no-deny Test that the session lockdown profile is not blocking more than it should Not Integrated PASSED N/A N/A PASSED N/A N/A Piyush Boopathi
apparmor-gstreamer1.0 Test that AppArmor profiles provided in GStreamer 1.0 works without Auditd complaining Integrated PASSED PASSED PASSED PASSED PASSED PASSED Araujo [201] [202] [203] [204] [205] [206]
apparmor-pulseaudio Test that AppArmor profiles provided in PulseAudio 2.1 work without Auditd complaining. Integrated PASSED PASSED PASSED PASSED PASSED PASSED Araujo [207] [208] [209] [210] [211] [212]
apparmor-webkit-clutter Tests that the webkit-clutter abstraction doesn't cause false negatives and that it does not allow arbitrary reading of files in the home directory. Integrated PARTIAL PARTIAL PARTIAL PARTIAL PARTIAL PARTIAL Araujo [213] [214] [215] [216] [217] [218] (bug 402)
apparmor-bluez-automated Test AppArmor profile for support for SPP profile (bluez-spp) and core functionalities (bluez-core). Not Integrated N/A N/A N/A PASSED N/A N/A Piyush
apparmor-bluez-avrcp-volume Test AppArmor profile for Bluez AVRCP volume up and down commands. Not Integrated PASSED N/A N/A PASSED N/A N/A Piyush Boopathi
apparmor-bluez-setup Test AppArmor profiles for setting up of Bluetooth stack by running basic tests using hciconfig. Check if the interface can be brought up/down, can be changed of mode and can discover devices. Not Integrated N/A N/A N/A PASSED N/A N/A Piyush
apparmor-folks Test that AppArmor profiles provided in Folks package work without unexpected auditd log entries. Integrated PARTIAL PARTIAL PARTIAL PARTIAL PARTIAL PARTIAL Araujo [219] [220] [221] [222] [223] [224] (bug 368)
apparmor-geoclue Test that geoclue apparmor profiles are working properly Integrated PASSED PASSED PASSED PASSED PASSED PASSED Araujo [225] [226] [227] [228] [229] [230]
apparmor-libreoffice Tests that the libreoffice profile doesn't cause false negatives and that it does not allow arbitrary reading of files in the home directory. Integrated PARTIAL PARTIAL PARTIAL PARTIAL PARTIAL PARTIAL Araujo [231] [232] [233] [234] [235] [236]
apparmor-ofono Test that AppArmor profiles provided in ofono package work without unexpected auditd log entries. Not Integrated N/A N/A N/A PASSED N/A N/A Piyush
apparmor-tracker Tests that the tracker abstraction and tracker profiles don't cause false negatives and that it does not allow arbitrary reading of files in the home directory. Integrated PARTIAL PARTIAL PARTIAL PARTIAL PARTIAL PARTIAL Araujo [237] [238] [239] [240] [241] [242] (bug 400)
apparmor-tumbler Tests that the tumbler profile doesn't cause false negatives and that it does not allow arbitrary reading of files in the home directory. Integrated PASSED PASSED PASSED PASSED PASSED PARTIAL Araujo [243] [244] [245] [246] [247] [248]
iptables-basic Test the firewall automatically. Integrated PASSED NOT TESTED PASSED PASSED PASSED PASSED Araujo [249] [250] [251] [252] [253]
iptables-nmap Test the firewall using nmap from another computer. Not Integrated PASSED N/A N/A PASSED N/A PASSED Parthiban Boopathi Piyush
apparmor-dbus Functional testing for AppArmor D-Bus mediation. Integrated PASSED PASSED PASSED PASSED PASSED PASSED Araujo [254] [255] [256] [257] [258] [259]
System Update
updater-update-platform Test that chaiwala-updater is capable of performing a full platform update. Not Integrated PASSED N/A N/A N/A N/A N/A Boopathi
btrfs-snapshot-management Test subvolume management using Btrfs for system upgrades. Integrated PASSED PASSED PASSED PASSED PASSED PASSED Araujo [260] [261] [262] [263] [264] [265]
factory-reset-tool Check if the system can be restored to a factory reset state. Not Integrated PARTIAL N/A N/A N/A N/A N/A Boopathi bug 386
last-resort-message Test whether U-Boot last resort image is displayed on boot failure Not Integrated PASSED N/A N/A N/A N/A N/A Boopathi
limited-functionality-manual Test whether the limited functionality mode can be triggered. Not Integrated NOT TESTED N/A N/A N/A N/A N/A Camera not available
v4l-automated Test the v4l codepaths of chaiwala-v4l2fb. Integrated PASSED PARTIAL FAILED PARTIAL PARTIAL PARTIAL Araujo [266] [267] [268] [269] [270] [271]
boot-performance Test boot performance. Not Integrated PASSED N/A N/A N/A N/A N/A Boopathi Boot chart Plot file
boot-performance-automated Test boot performance. Integrated PASSED PASSED PASSED PASSED PASSED PASSED Araujo [272] [273] [274] [275] [276] [277]
Webkit
webkit-aligned-scroll Test that scrolling is pinned in a given direction when started mostly towards it. Not Integrated FAILED N/A N/A FAILED N/A N/A Piyush Boopathi bug 349
webkit-lazy-click Test touch adjustment (lazy click) support in WebKit-Clutter Not Integrated FAILED N/A N/A FAILED N/A FAILED Piyush Boopathi Parthiban bug 349
webkit-drag-and-drop Test HTML5 drag-and-drop support in WebKit-Clutter Not Integrated FAILED N/A N/A FAILED N/A FAILED Parthiban Piyush Boopathi bug 349
webkit-contextual-zoom This test case is about zooming parts of a web page to make it easier to read on devices with limited screen area. The scope of the test is the zooming functionality that takes into account the content in the clicked area, other functionality that belongs to a real browser isn't to be tested here. Not Integrated FAILED N/A N/A FAILED N/A FAILED Parthiban Piyush Boopathi bug 349
webkit-clutter-javascriptcore JavaScriptCore tests are implementation of the Mozilla JavaScript Test Suite. This test suite covers the functionality of the core JavaScript engine. This includes several JavaScript objects such as Arrays, Booleans, Dates, Functions, Global Object, Math, Numbers, Objects, Regular Expressions and Strings. In addition the JavaScript tests cover parsing, lexical conventions, expressions, statements, type conversion, and exception handling. Integrated PARTIAL PARTIAL PARTIAL PARTIAL PARTIAL PARTIAL Araujo [278] [279] [280] [281] [282] [283]
PASSED - All tests passed.
PARTIAL - Tests mostly passed, with some minor problems.
FAILED - One or more tests failed.
NOT TESTED - Test not run due to some issue, like WIP, Disabled, lacking proper hardware.
Personal tools
Namespaces

Variants
Actions
Navigation
Tools