15.03/TestReports/20150219

From Apertis
Jump to: navigation, search


Testing results considerations:

  1. All manual test cases were executed on Target x86 and SDK x86 image, and were executed as needed by the development team on the Target ARM image.
  2. All automated test cases already integrated into LAVA system were executed on images: Target ARM, Target x86, Development x86 and SDK x86.
  3. Test cases marked as 'under development' were skipped during this testing round.
  4. Failures and partial failures were noted in the Release notes document for further analyse.




ID Description Type Target ARM Devel ARM Target x86 Devel x86 SDK x86 Tested By Notes
Booting
image-bootable Test whether the image is bootable. Not Integrated PASSED NOT TESTED PASSED PASSED PASSED Parthiban Boopathi Piyush ARM development image not available
image-x-start Test whether the image starts a graphical environment. Not Integrated PASSED NOT TESTED PASSED PASSED PASSED Piyush Parthiban Boopathi ARM development image not available
HW Acceleration
x-hw-accelerated Test whether the correct GLES2 render is used. Not Integrated PASSED N/A PASSED N/A PASSED Parthiban Boopathi
GStreamer
clutter-playback-gstreamer1.0 Test video and audio playback using clutter-gst and GStreamer1.0. Not Integrated FAILED N/A FAILED N/A FAILED Piyush Parthiban Boopathi bug 6
gstreamer1.0-decode Test video and audio decoders and demuxers on a list of media. Integrated NOT TESTED N/A PASSED PASSED PASSED zumbi [1] [2] [3]
Multitouch
clutter-actors-bigger-reactive-area Test that Clutter allows an actor's pick area to be larger than its paint area. Not Integrated PASSED N/A PASSED N/A PASSED Parthiban Boopathi Piyush
clutter-mt-rotate Test that clutter properly performs rotation gestures. Not Integrated PASSED N/A PASSED N/A N/A Boopathi Piyush
clutter-mt-touch-events Test multi-touch support in Clutter. Not Integrated PASSED N/A PASSED N/A N/A Boopathi Piyush
clutter-mt-zoom Test that clutter properly performs zoom gestures. Not Integrated PASSED N/A PASSED N/A N/A Boopathi Piyush
clutter-transparent-stage Test that clutter transparent stages are correctly handled by the graphics stack. Not Integrated PASSED N/A PASSED N/A N/A Boopathi Piyush
mutter-mt-touch-events Allow Mutter plugins to recognize multi-touch gestures.

This test is used for both touchscreen *and* the Magic Trackpad. So please, do test for both cases below:

Not Integrated PASSED N/A PASSED N/A N/A Boopathi Piyush
webkit-mt-touch-events Test implementation of W3C touch events API in webkit-clutters. Not Integrated PASSED N/A PASSED N/A N/A Boopathi Piyush
xephyr-mt-touch-events Test that X clients within Xephyr receive touch events forwarded from the host X display.

This test is used for both touchscreen *and* support for the Magic Trackpad. So please, do test for both cases below:

Not Integrated N/A N/A N/A N/A FAILED Parthiban bug 8
WebKit
webkit-actor-tiles Test implementation of actor-based tiled backing store in webkit-clutter. Not Integrated PASSED N/A PASSED N/A PASSED Parthiban Boopathi Piyush
webkit-event-handling-redesign Test WebKit-Clutter ability to scroll by touch with inertial behaviour after the touch ended. Not Integrated PASSED N/A PASSED N/A PASSED Parthiban Boopathi Piyush
webkit-layout-tests Layout tests are used to check the correctness of the renderer. It involves loading pages in a test renderer (DumpRenderTree) and comparing the rendered output tree against an expected output file. Integrated NOT TESTED N/A FAILED FAILED FAILED zumbi [4] [5] [6]
Webkit-AC
webkit-ac-3d-rendering Test that 3D transforms are applied correctly. Not Integrated PASSED N/A PASSED N/A PASSED Boopathi Parthiban Piyush
webkit-ac-animations Test that Clutter actors created for representing layers animate properly. Not Integrated PASSED N/A PASSED N/A PASSED Boopathi Parthiban Piyush
webkit-ac-scrolling Test that actors created for representing layers scroll properly. Not Integrated PASSED N/A PASSED N/A PASSED Boopathi Parthiban Piyush
Gettext
clutter-i18n-gettext Check that internationalization (translation) of Clutter applications using gettext works. Not Integrated PASSED N/A PASSED N/A PASSED Boopathi Parthiban Piyush
gettext-i18n Check that gettext internationalization works. Integrated NOT TESTED N/A PASSED PASSED PASSED zumbi [7] [8] [9]
'
gupnp-services Run a few tests related to service browsing, introspection, etc. Integrated NOT TESTED N/A PASSED PASSED PASSED zumbi [10] [11] [12]
librest-unit Run the unit tests that ship with the library against the running system. Integrated NOT_TESTED N/A PASSED PASSED PASSED zumbi [13] [14] [15]
libsoup-unit Run the unit tests that ship with the library against the running system. Integrated NOT TESTED N/A PARTIAL PARTIAL PARTIAL zumbi [16] [17] [18]
tracker-configuration Check if tracker indexing is configured properly. Integrated NOT TESTED N/A PASSED PASSED PASSED zumbi [19] [20] [21]
tracker-indexing-local-storage Check tracker indexing of local storage and journal behaviour. Integrated NOT TESTED N/A FAILED FAILED FAILED zumbi [22] [23] [24]
tracker-indexing-mass-storage Check tracker indexes mass storage devices on insertion. Not Integrated FAILED N/A FAILED N/A FAILED Boopathi Piyush Parthiban bug 9
tumbler-thumbnailing Check that all thumbnailing features of tumbler are working properly (large, small, videos, documents, images). Integrated NOT TESTED N/A FAILED FAILED FAILED zumbi [25] [26] [27]
Grilo
grilo Check grilo metadata notifications, and filesystem browsing. Integrated NOT TESTED N/A PASSED PASSED PASSED zumbi [28] [29] [30]
Networking
bluez-avrcp-volume Test the AVRCP volume up and down commands. Not Integrated FAILED N/A FAILED N/A N/A Boopathi Piyush bug 25
bluez-phone Test all BlueZ features needing interaction with a phone (Pairing, OBEX, PBAP, AVRCP, A2DP, HSP, HFP, PAN). Not Integrated FAILED N/A FAILED N/A N/A Boopathi Piyush bug 25
bluez-setup Test setup of Bluetooth stack by running basic tests using hciconfig. Check if the interface can be brought up/down, can be changed of mode and can discover devices. Not Integrated FAILED N/A FAILED N/A FAILED Boopathi Parthiban Piyush bug 8
connman Runs some automated tests using the ConnMan D-Bus API. It guarantees most of the basic features are working. Integrated NOT TESTED N/A PASSED PASSED PASSED zumbi [31] [32] [33]
connman-new-supplicant Test the wpa_supplicant interface. Integrated NOT TESTED N/A PASSED PASSED PASSED zumbi [34] [35] [36]
connman-pan-tethering Test ConnMan support for PAN connectivity. Not Integrated NOT TESTED N/A NOT TESTED N/A NOT TESTED bug 8
connman-services Tests ConnMan services. Not Integrated PASSED N/A PASSED N/A PASSED Boopathi Piyush Parthiban
connman-usb-tethering Test ConnMan support for USB tethering (connection side). Not Integrated PASSED N/A PASSED N/A N/A Boopathi Piyush
ofono-sms-receive Test receiving SMS messages with oFono. Not Integrated N/A N/A FAILED N/A FAILED Piyush Parthiban bug 12
ofono-sms-send Test sending of SMS with oFono. Not Integrated N/A N/A FAILED N/A FAILED Piyush Parthiban bug 12
Folks
folks-alias-persistence Ensures user-set contact aliases persist. Integrated NOT TESTED N/A FAILED FAILED FAILED zumbi [37] [38] [39]
folks-eds-compatibility Checks that contacts created within Evolution Data Server (as will happen when phone contacts get synchronized to an Apertis machine) show up in other contact-based programs. Integrated NOT TESTED N/A FAILED FAILED FAILED zumbi [40] [41] [42]
folks-metacontacts-linking Ensures linking meta-contacts works properly. Integrated NOT TESTED N/A FAILED FAILED FAILED zumbi [43] [44] [45]
folks-metacontacts-unlinking Ensures unlinking meta-contacts works properly. Integrated NOT TESTED N/A FAILED FAILED FAILED zumbi [46] [47] [48]
folks-telepathy-retrieve-contacts Ensures that Folks can correctly retrieve Telepathy contacts. Integrated NOT TESTED N/A FAILED FAILED FAILED zumbi [49] [50] [51]
LibsocialWeb
libsocialweb-available Ensures libsocialweb client is available. Integrated NOT TESTED N/A FAILED FAILED FAILED zumbi [52] [53] [54]
folks-libsocialweb-available Ensures folks libsocialweb backend is available. Integrated NOT TESTED N/A FAILED FAILED FAILED zumbi [55] [56] [57]
Telepathy
telepathy-gabble-unit Run telepathy-gabble test suite. Integrated NOT TESTED N/A PARTIAL PARTIAL PARTIAL zumbi [58] [59] [60]
telepathy-rakia Test Telepathy rakia integration Not Integrated PASSED N/A PASSED N/A PASSED Boopathi Parthiban
SDK Development
sdk-ide-build-run-program Creates a simple test project and confirms that compiling and executing work. Not Integrated N/A N/A N/A N/A PASSED Parthiban
sdk-nested-wm Tests that Devilspie scripts can be applied to windows running within Mutter. Not Integrated N/A N/A N/A N/A PASSED Parthiban
Apparmor Basic
apparmor-basic-profiles Test basic apparmor profiles. Only parsing and syntax of profiles are tested for now. Integrated NOT TESTED N/A PARTIAL PARTIAL PASSED zumbi [61] [62] [63]
CGroups
cgroups-resource-control Run cgroup resource control tests Integrated NOT TESTED N/A PARTIAL PARTIAL PARTIAL zumbi [64] [65] [66]
SDK
sdk-performance-tools-gprof-smoke-test Checks basic gprof functionality by ensuring a CPU-intensive program shows up in its log as consuming the vast majority of the CPU cycles. Integrated N/A N/A N/A N/A PASSED zumbi [67]
sdk-performance-tools-sysprof-smoke-test Checks basic sysprof functionality by ensuring a CPU-intensive program shows up in its log as consuming the vast majority of the CPU cycles. Integrated N/A N/A N/A N/A PASSED zumbi [68]
sdk-debug-tools-gdb-smoke-test Checks basic gdb functionality by stopping a program at a set point and checking its backtrace matches expectations. Integrated N/A N/A N/A N/A FAILED zumbi [69]
sdk-debug-tools-strace-smoke-test Checks basic strace functionality by checking its output when run on a simple command line program. Integrated N/A N/A N/A N/A FAILED zumbi [70]
sdk-debug-tools-valgrind-smoke-test Checks basic valgrind functionality by running a program with and without memory leaks, ensuring expected results from valgrind. Integrated N/A N/A N/A N/A FAILED zumbi [71]
sdk-dbus-tools-bustle-smoke-test Test that bustle-dbus-monitor shows services on the session bus. Not Integrated N/A N/A N/A N/A FAILED Parthiban bug 10
sdk-dbus-tools-d-feet-smoke-test Test that D-Feet both shows services on the session bus and that new services appear automatically. Not Integrated N/A N/A N/A N/A FAILED Parthiban bug 10
sdk-code-analysis-tools-gcov-smoke-test Checks basic gcov functionality by running a sample program a few different ways and ensuring that a sufficient portion of its code paths are executed Integrated N/A N/A N/A N/A FAILED zumbi [72]
sdk-code-analysis-tools-splint-smoke-test Checks basic splint functionality by checking its output when run on a simple source file. Integrated N/A N/A N/A N/A FAILED zumbi [73]
sdk-vb-fullscreen Tests that the SDK VM can be fullscreened in VirtualBox Not Integrated N/A N/A N/A N/A FAILED Parthiban bug 55
Eclipse
eclipse-sysroot-management Test sysroot management and update within Eclipse. It will go through configuring an existing sysroot in Eclipse, and then updating it from the web with the latest version. Not Integrated N/A N/A N/A N/A FAILED Parthiban bug 26
eclipse-install-to-target Test copying files to the remote device from within Eclipse. It will create a dummy project and then create a configuration to copy the binary file to a remote device and debug it remotely using Eclipse. Not Integrated N/A N/A N/A N/A PASSED Parthiban
eclipse-remote-debugging Test remote debugging within Eclipse. It will create a dummy project and then create a configuration to copy the binary file to a remote device and debug it remotely using Eclipse. Not Integrated N/A N/A N/A N/A FAILED Parthiban bug 18
Contacts
evolution-sync-bluetooth Synchronizing Bluetooth-paired phone contacts to Evolution. Not Integrated NOT TESTED N/A NOT TESTED N/A NOT TESTED Blocked because of bug 8
folks-metacontacts-antilinking Ensures anti-linking meta-contacts works properly. Integrated NOT TESTED N/A FAILED FAILED FAILED zumbi [74] [75] [76]
Clutter Multitouch
xoo-soft-keys-emulation Test that 'xoo' allows one to pass-in Xephyr-nested key events from clicking UI buttons Integrated N/A N/A N/A N/A FAILED zumbi [77]
clutter-performance Test performance of Clutter Integrated NOT TESTED N/A PASSED PASSED PASSED zumbi [78] [79] [80]
x-out-of-screen-events-buttond Test that buttond generates correct keystrokes in response to simulated touch screen input Integrated NOT TESTED N/A PASSED PASSED PASSED zumbi [81] [82] [83]
mxkineticscrollview-smooth-pan Some low-resolution touch screens send touch events in widely separate time intervals, which causes MxKineticScrollView widget to jump from one position to the next one without any visible transition. This test case implements a long list to scroll through to make sure there are no visible "jumps" when scrolling. Not Integrated PASSED N/A PASSED N/A PASSED Piyush Boopathi Parthiban
Connectivity
bluez-hfp Test Hands Free Profile (HFP) BlueZ feature. Not Integrated N/A N/A FAILED N/A N/A Piyush bug 8
rfkill-toggle Test that rfkill is functional. Not Integrated PASSED N/A PASSED N/A N/A Piyush Boopathi
telepathy-ring Support making and receiving phone calls in Telepathy manually, with a bluetooth-paired phone. Not Integrated NOT TESTED N/A NOT TESTED N/A NOT TESTED Blocked because of bug 25
telepathy-ring-automated Support making and receiving phone calls in Telepathy. Integrated N/A N/A N/A N/A FAILED zumbi [84]
Contacts
folks-ofono-backend Reading contacts from 3G modem SIM card. Not Integrated N/A N/A FAILED N/A FAILED Piyush Parthiban bug 12
folks-search-contacts Ensures that Folks can correctly search contacts. Integrated NOT TESTED N/A FAILED FAILED FAILED zumbi [85] [86] [87]
abstract-contact-addressbook-creation A way to be able to create abstract addressbook is needed in SyncEvolution, so that separate addressbooks can be created for each paired device. Integrated NOT TESTED N/A FAILED FAILED FAILED zumbi [88] [89] [90]
folks-sync-only Test SYNCHRONIZE_ONLY flag for persona stores in Folks. Integrated N/A N/A N/A N/A FAILED zumbi [91]
storage-arbitrary-data-contacts Support for storing arbitrary data in contacts in Folks. Integrated NOT TESTED N/A NOT TESTED NOT TESTED NOT TESTED zumbi [92] [93] [94]
Meta Data Management
grilo-playlist-browsing Test playlist browsing from grilo, that is basically Grilo can inspect playlist contents and show its entries as if they were Grilo Media objects. Integrated NOT TESTED N/A PASSED PASSED PASSED zumbi [95] [96] [97]
Multimedia
webkit-gstreamer1.0 Tests html5 video playback with GStreamer 1.0 in WebKit-Clutter Not Integrated PASSED N/A FAILED N/A FAILED Piyush Parthiban Boopathi bug 6
clutter-buffering-2.0 Test clutter-gst stream buffering support against gstreamer 1.0. Not Integrated PASSED N/A PASSED N/A PASSED Piyush Boopathi Parthiban
clutter-live-media-2.0 Test clutter-gst live media improvements support against gstreamer 1.0. Not Integrated PASSED N/A PASSED N/A PASSED Piyush Boopathi Parthiban
traffic-control-basic Test basic traffic control support. This test does not use tcmmd but it could catch missing support in the kernel or misbehaving traffic control. Not Integrated PASSED N/A PASSED N/A PASSED Piyush Parthiban Boopathi
traffic-control-tcmmd Test traffic control support with tcmmd and wget. Not Integrated PASSED N/A PASSED N/A PASSED Piyush Parthiban Boopathi
traffic-control-tcdemo Test traffic control demo with tcmmd and tcdemo. Not Integrated PASSED N/A PASSED N/A N/A Piyush Boopathi
gstreamer-buffering Test the download-buffering playback mode of clutter-gst-3.0. Not Integrated FAILED N/A FAILED N/A FAILED Piyush Parthiban Boopathi bug 20
gstreamer-splash Test whether the gstreamer splash plugin is working. Not Integrated NOT TESTED N/A N/A N/A N/A Camera not available
video-animation-on-boot Test whether Plymouth is able to display a graphical theme. Not Integrated PASSED N/A PASSED N/A N/A Piyush Boopathi
gstreamer-viv-direct-texture Test the GStreamer integration of the Vivante direct texture extension, which enables fast video playback on i.MX6. Not Integrated PASSED N/A N/A N/A N/A Boopathi
Robustness
glib-gio-fs Run the GLib gio tests that do I/O on the local filesystem. Integrated NOT TESTED N/A PASSED PASSED PASSED zumbi [98] [99] [100]
sqlite-veryquick Run the "veryquick" tests shipped with SQLite. Integrated NOT TESTED N/A PARTIAL PARTIAL PARTIAL zumbi [101] [102] [103]
Security
apparmor Functional testing for AppArmor functionalities. Integrated NOT TESTED N/A PARTIAL PARTIAL PARTIAL zumbi [104] [105] [106]
apparmor-chaiwala-system Test that AppArmor's system wide rules works according to Apertis security goals. Integrated NOT TESTED N/A PARTIAL PARTIAL PARTIAL zumbi [107] [108] [109]
apparmor-functional-demo Show some main AppArmor functionalities, like transitions, net access or resource permissions, under the form of tests. Integrated NOT TESTED N/A PARTIAL PARTIAL PARTIAL zumbi [110] [111] [112]
apparmor-utils Test apparmor_parser and other tools in apparmor package can be executed. Integrated NOT TESTED N/A PARTIAL PARTIAL PARTIAL zumbi [113] [114] [115]
apparmor-session-lockdown-denies Test that the MxLauncher profile is indeed limited to what is allows. Not Integrated FAILED N/A FAILED N/A N/A Piyush Boopathi bug 7
apparmor-session-lockdown-launcher-whitelist Make sure our demo/test launcher is applying the white-list approach properly. Not Integrated FAILED N/A FAILED N/A N/A Piyush Boopathi bug 7
apparmor-session-lockdown-no-deny Test that the session lockdown profile is not blocking more than it should Not Integrated FAILED N/A FAILED N/A N/A Piyush Boopathi bug 24
apparmor-gstreamer1.0 Test that AppArmor profiles provided in GStreamer 1.0 works without Auditd complaining Integrated NOT TESTED N/A FAILED FAILED FAILED zumbi [116] [117] [118]
apparmor-pulseaudio Test that AppArmor profiles provided in PulseAudio 2.1 work without Auditd complaining. Integrated NOT TESTED N/A FAILED N/A N/A zumbi [119] [120] [121]
apparmor-webkit-clutter Tests that the webkit-clutter abstraction doesn't cause false negatives and that it does not allow arbitrary reading of files in the home directory. Integrated NOT TESTED N/A FAILED N/A N/A zumbi [122]
apparmor-bluez-automated Test AppArmor profile for support for SPP profile (bluez-spp) and core functionalities (bluez-core). Not Integrated N/A N/A FAILED N/A N/A Piyush bug 8
apparmor-bluez-avrcp-volume Test AppArmor profile for Bluez AVRCP volume up and down commands. Not Integrated NOT TESTED N/A NOT TESTED N/A N/A Blocked because of bug 25
apparmor-bluez-setup Test AppArmor profiles for setting up of Bluetooth stack by running basic tests using hciconfig. Check if the interface can be brought up/down, can be changed of mode and can discover devices. Not Integrated N/A N/A FAILED N/A N/A Piyush bug 8
apparmor-folks Test that AppArmor profiles provided in Folks package work without unexpected auditd log entries. Integrated NOT TESTED N/A FAILED FAILED FAILED zumbi [123] [124] [125]
apparmor-geoclue Test that geoclue apparmor profiles are working properly Integrated NOT TESTED N/A FAILED FAILED FAILED zumbi [126] [127] [128]
apparmor-libreoffice Tests that the libreoffice profile doesn't cause false negatives and that it does not allow arbitrary reading of files in the home directory. Integrated NOT TESTED N/A FAILED FAILED PARTIAL zumbi [129] [130] [131]
apparmor-ofono Test that AppArmor profiles provided in ofono package work without unexpected auditd log entries. Not Integrated N/A N/A FAILED N/A N/A Piyush bug 29
apparmor-tracker Tests that the tracker abstraction and tracker profiles don't cause false negatives and that it does not allow arbitrary reading of files in the home directory. Integrated NOT TESTED N/A FAILED FAILED FAILED zumbi [132] [133] [134]
apparmor-tumbler Tests that the tumbler profile doesn't cause false negatives and that it does not allow arbitrary reading of files in the home directory. Integrated NOT TESTED N/A PARTIAL PARTIAL PARTIAL zumbi [135] [136] [137]
iptables-basic Test the firewall automatically. Integrated NOT TESTED N/A PASSED PASSED PASSED zumbi [138] [139] [140]
iptables-nmap Test the firewall using nmap from another computer. Not Integrated PASSED N/A PASSED N/A PASSED Piyush Parthiban Boopathi
apparmor-dbus Functional testing for AppArmor D-Bus mediation. Integrated NOT TESTED N/A FAILED FAILED FAILED zumbi [141] [142] [143]
System Update
updater-update-platform Test that chaiwala-updater is capable of performing a full platform update. Not Integrated FAILED N/A N/A N/A N/A Boopathi bug 27
btrfs-snapshot-management Test subvolume management using Btrfs for system upgrades. Integrated NOT TESTED N/A PASSED PASSED PASSED zumbi [144] [145] [146]
factory-reset-tool Check if the system can be restored to a factory reset state. Not Integrated PASSED N/A N/A N/A N/A Boopathi
last-resort-message Test whether U-Boot last resort image is displayed on boot failure Not Integrated PASSED N/A N/A N/A N/A
limited-functionality-manual Test whether the limited functionality mode can be triggered. Not Integrated NOT TESTED N/A N/A N/A N/A Boopathi Camera not available
v4l-automated Test the v4l codepaths of chaiwala-v4l2fb. Integrated N/A N/A FAILED FAILED N/A zumbi [147] [148] [149]
boot-performance Test boot performance. Not Integrated PASSED N/A N/A N/A N/A Boopathi Boot chart Plot file
boot-performance-automated Test boot performance. Integrated NOT TESTED N/A PASSED PASSED PASSED zumbi [150] [151] [152]
Webkit
webkit-aligned-scroll Test that scrolling is pinned in a given direction when started mostly towards it. Not Integrated PASSED N/A PASSED N/A N/A Boopathi Piyush
webkit-lazy-click Test touch adjustment (lazy click) support in WebKit-Clutter Not Integrated PASSED N/A PASSED N/A PASSED Boopathi Piyush Parthiban
webkit-drag-and-drop Test HTML5 drag-and-drop support in WebKit-Clutter Not Integrated PASSED N/A PASSED N/A PASSED Boopathi Piyush Parthiban
webkit-contextual-zoom This test case is about zooming parts of a web page to make it easier to read on devices with limited screen area. The scope of the test is the zooming functionality that takes into account the content in the clicked area, other functionality that belongs to a real browser isn't to be tested here. Not Integrated PASSED N/A PASSED N/A PASSED Boopathi Piyush Parthiban
webkit-clutter-javascriptcore JavaScriptCore tests are implementation of the Mozilla JavaScript Test Suite. This test suite covers the functionality of the core JavaScript engine. This includes several JavaScript objects such as Arrays, Booleans, Dates, Functions, Global Object, Math, Numbers, Objects, Regular Expressions and Strings. In addition the JavaScript tests cover parsing, lexical conventions, expressions, statements, type conversion, and exception handling. Integrated NOT TESTED N/A PASSED PASSED PASSED zumbi [153] [154] [155]
PASSED - All tests passed.
PARTIAL - Tests mostly passed, with some minor problems.
FAILED - One or more tests failed.
NOT TESTED - Test not run due to some issue, like WIP, Disabled, lacking proper hardware.
Personal tools
Namespaces

Variants
Actions
Navigation
Tools